<?xml version="1.0" encoding="utf-8" standalone="no"?>
<!DOCTYPE svg PUBLIC "-//W3C//DTD SVG 1.1//EN"
  "http://www.w3.org/Graphics/SVG/1.1/DTD/svg11.dtd">
<svg xmlns:xlink="http://www.w3.org/1999/xlink" width="576pt" height="576pt" viewBox="0 0 576 576" xmlns="http://www.w3.org/2000/svg" version="1.1">
 <metadata>
  <rdf:RDF xmlns:dc="http://purl.org/dc/elements/1.1/" xmlns:cc="http://creativecommons.org/ns#" xmlns:rdf="http://www.w3.org/1999/02/22-rdf-syntax-ns#">
   <cc:Work>
    <dc:type rdf:resource="http://purl.org/dc/dcmitype/StillImage"/>
    <dc:date>2022-12-10T03:17:46.144366</dc:date>
    <dc:format>image/svg+xml</dc:format>
    <dc:creator>
     <cc:Agent>
      <dc:title>Matplotlib v3.6.2, https://matplotlib.org/</dc:title>
     </cc:Agent>
    </dc:creator>
   </cc:Work>
  </rdf:RDF>
 </metadata>
 <defs>
  <style type="text/css">*{stroke-linejoin: round; stroke-linecap: butt}</style>
 </defs>
 <g id="figure_1">
  <g id="patch_1">
   <path d="M 0 576 
L 576 576 
L 576 0 
L 0 0 
z
" style="fill: #ffffff"/>
  </g>
  <g id="axes_1">
   <g id="LineCollection_1">
    <path d="M 98.837064 461.701499 
L 171.05959 378.45956 
" clip-path="url(#pd13ad75489)" style="fill: none; stroke: #000000; stroke-width: 1.5"/>
    <path d="M 153.896433 418.522175 
L 171.05959 378.45956 
" clip-path="url(#pd13ad75489)" style="fill: none; stroke: #000000; stroke-width: 1.5"/>
    <path d="M 112.924197 460.206939 
L 171.05959 378.45956 
" clip-path="url(#pd13ad75489)" style="fill: none; stroke: #000000; stroke-width: 1.5"/>
    <path d="M 80.250723 479.456487 
L 171.05959 378.45956 
" clip-path="url(#pd13ad75489)" style="fill: none; stroke: #000000; stroke-width: 1.5"/>
    <path d="M 86.83259 439.348178 
L 171.05959 378.45956 
" clip-path="url(#pd13ad75489)" style="fill: none; stroke: #000000; stroke-width: 1.5"/>
    <path d="M 181.700651 459.89011 
L 181.700651 378.45956 
" clip-path="url(#pd13ad75489)" style="fill: none; stroke: #000000; stroke-width: 1.5"/>
    <path d="M 241.557717 421.371545 
L 241.557717 378.45956 
" clip-path="url(#pd13ad75489)" style="fill: none; stroke: #000000; stroke-width: 1.5"/>
    <path d="M 211.944505 502.244829 
L 211.944505 378.45956 
" clip-path="url(#pd13ad75489)" style="fill: none; stroke: #000000; stroke-width: 1.5"/>
    <path d="M 175.259285 502.485151 
L 175.259285 378.45956 
" clip-path="url(#pd13ad75489)" style="fill: none; stroke: #000000; stroke-width: 1.5"/>
    <path d="M 199.946609 436.049955 
L 199.946609 378.45956 
" clip-path="url(#pd13ad75489)" style="fill: none; stroke: #000000; stroke-width: 1.5"/>
    <path d="M 100.044508 348.914792 
L 171.05959 348.914792 
" clip-path="url(#pd13ad75489)" style="fill: none; stroke: #000000; stroke-width: 1.5"/>
    <path d="M 90.485849 357.858907 
L 171.05959 357.858907 
" clip-path="url(#pd13ad75489)" style="fill: none; stroke: #000000; stroke-width: 1.5"/>
    <path d="M 93.946764 297.889938 
L 171.05959 297.889938 
" clip-path="url(#pd13ad75489)" style="fill: none; stroke: #000000; stroke-width: 1.5"/>
    <path d="M 132.055229 309.932686 
L 171.05959 309.932686 
" clip-path="url(#pd13ad75489)" style="fill: none; stroke: #000000; stroke-width: 1.5"/>
    <path d="M 119.91706 316.702823 
L 171.05959 316.702823 
" clip-path="url(#pd13ad75489)" style="fill: none; stroke: #000000; stroke-width: 1.5"/>
    <path d="M 103.371101 306.724839 
L 171.05959 306.724839 
" clip-path="url(#pd13ad75489)" style="fill: none; stroke: #000000; stroke-width: 1.5"/>
    <path d="M 177.538234 302.815157 
L 177.538234 302.815157 
" clip-path="url(#pd13ad75489)" style="fill: none; stroke: #000000; stroke-width: 1.5"/>
    <path d="M 182.463558 380.680711 
L 182.463558 378.45956 
" clip-path="url(#pd13ad75489)" style="fill: none; stroke: #000000; stroke-width: 1.5"/>
    <path d="M 253.052369 309.601442 
L 253.052369 309.601442 
" clip-path="url(#pd13ad75489)" style="fill: none; stroke: #000000; stroke-width: 1.5"/>
    <path d="M 240.441987 371.528976 
L 240.441987 371.528976 
" clip-path="url(#pd13ad75489)" style="fill: none; stroke: #000000; stroke-width: 1.5"/>
    <path d="M 240.392128 387.067743 
L 240.392128 378.45956 
" clip-path="url(#pd13ad75489)" style="fill: none; stroke: #000000; stroke-width: 1.5"/>
    <path d="M 252.098001 392.791084 
L 252.098001 378.45956 
" clip-path="url(#pd13ad75489)" style="fill: none; stroke: #000000; stroke-width: 1.5"/>
    <path d="M 273.595054 340.046011 
L 273.595054 340.046011 
" clip-path="url(#pd13ad75489)" style="fill: none; stroke: #000000; stroke-width: 1.5"/>
    <path d="M 336.045808 478.070293 
L 336.045808 378.45956 
" clip-path="url(#pd13ad75489)" style="fill: none; stroke: #000000; stroke-width: 1.5"/>
    <path d="M 328.398399 431.600242 
L 328.398399 378.45956 
" clip-path="url(#pd13ad75489)" style="fill: none; stroke: #000000; stroke-width: 1.5"/>
    <path d="M 378.527355 425.414754 
L 378.527355 378.45956 
" clip-path="url(#pd13ad75489)" style="fill: none; stroke: #000000; stroke-width: 1.5"/>
    <path d="M 366.577489 484.049654 
L 366.577489 378.45956 
" clip-path="url(#pd13ad75489)" style="fill: none; stroke: #000000; stroke-width: 1.5"/>
    <path d="M 394.272499 463.084757 
L 394.272499 378.45956 
" clip-path="url(#pd13ad75489)" style="fill: none; stroke: #000000; stroke-width: 1.5"/>
    <path d="M 368.080449 445.765509 
L 368.080449 378.45956 
" clip-path="url(#pd13ad75489)" style="fill: none; stroke: #000000; stroke-width: 1.5"/>
    <path d="M 452.112344 506.037643 
L 429.838266 378.45956 
" clip-path="url(#pd13ad75489)" style="fill: none; stroke: #000000; stroke-width: 1.5"/>
    <path d="M 431.778696 459.174053 
L 429.838266 378.45956 
" clip-path="url(#pd13ad75489)" style="fill: none; stroke: #000000; stroke-width: 1.5"/>
    <path d="M 415.638483 471.829935 
L 415.638483 378.45956 
" clip-path="url(#pd13ad75489)" style="fill: none; stroke: #000000; stroke-width: 1.5"/>
    <path d="M 447.543702 467.732341 
L 429.838266 378.45956 
" clip-path="url(#pd13ad75489)" style="fill: none; stroke: #000000; stroke-width: 1.5"/>
    <path d="M 502.051017 450.973282 
L 429.838266 378.45956 
" clip-path="url(#pd13ad75489)" style="fill: none; stroke: #000000; stroke-width: 1.5"/>
    <path d="M 461.2001 472.805628 
L 429.838266 378.45956 
" clip-path="url(#pd13ad75489)" style="fill: none; stroke: #000000; stroke-width: 1.5"/>
    <path d="M 499.772102 447.071089 
L 429.838266 378.45956 
" clip-path="url(#pd13ad75489)" style="fill: none; stroke: #000000; stroke-width: 1.5"/>
    <path d="M 297.138234 368.514781 
L 297.138234 368.514781 
" clip-path="url(#pd13ad75489)" style="fill: none; stroke: #000000; stroke-width: 1.5"/>
    <path d="M 331.537955 367.893693 
L 331.537955 367.893693 
" clip-path="url(#pd13ad75489)" style="fill: none; stroke: #000000; stroke-width: 1.5"/>
    <path d="M 293.677556 294.777339 
L 293.677556 294.777339 
" clip-path="url(#pd13ad75489)" style="fill: none; stroke: #000000; stroke-width: 1.5"/>
    <path d="M 380.174508 343.39792 
L 380.174508 343.39792 
" clip-path="url(#pd13ad75489)" style="fill: none; stroke: #000000; stroke-width: 1.5"/>
    <path d="M 389.431775 294.704822 
L 389.431775 294.704822 
" clip-path="url(#pd13ad75489)" style="fill: none; stroke: #000000; stroke-width: 1.5"/>
    <path d="M 343.908618 297.411902 
L 343.908618 297.411902 
" clip-path="url(#pd13ad75489)" style="fill: none; stroke: #000000; stroke-width: 1.5"/>
    <path d="M 367.496902 349.379261 
L 367.496902 349.379261 
" clip-path="url(#pd13ad75489)" style="fill: none; stroke: #000000; stroke-width: 1.5"/>
    <path d="M 459.497985 384.818668 
L 429.838266 378.45956 
" clip-path="url(#pd13ad75489)" style="fill: none; stroke: #000000; stroke-width: 1.5"/>
    <path d="M 466.040786 348.271692 
L 429.838266 348.271692 
" clip-path="url(#pd13ad75489)" style="fill: none; stroke: #000000; stroke-width: 1.5"/>
    <path d="M 441.588257 327.417881 
L 429.838266 327.417881 
" clip-path="url(#pd13ad75489)" style="fill: none; stroke: #000000; stroke-width: 1.5"/>
    <path d="M 502.464674 298.562778 
L 429.838266 298.562778 
" clip-path="url(#pd13ad75489)" style="fill: none; stroke: #000000; stroke-width: 1.5"/>
    <path d="M 471.022932 295.289251 
L 429.838266 295.289251 
" clip-path="url(#pd13ad75489)" style="fill: none; stroke: #000000; stroke-width: 1.5"/>
    <path d="M 491.422984 318.76773 
L 429.838266 318.76773 
" clip-path="url(#pd13ad75489)" style="fill: none; stroke: #000000; stroke-width: 1.5"/>
    <path d="M 437.560835 316.903991 
L 429.838266 316.903991 
" clip-path="url(#pd13ad75489)" style="fill: none; stroke: #000000; stroke-width: 1.5"/>
    <path d="M 82.842291 263.650956 
L 171.05959 263.650956 
" clip-path="url(#pd13ad75489)" style="fill: none; stroke: #000000; stroke-width: 1.5"/>
    <path d="M 92.793266 240.210388 
L 171.05959 240.210388 
" clip-path="url(#pd13ad75489)" style="fill: none; stroke: #000000; stroke-width: 1.5"/>
    <path d="M 98.690096 275.53072 
L 171.05959 275.53072 
" clip-path="url(#pd13ad75489)" style="fill: none; stroke: #000000; stroke-width: 1.5"/>
    <path d="M 152.940897 196.335239 
L 171.05959 196.335239 
" clip-path="url(#pd13ad75489)" style="fill: none; stroke: #000000; stroke-width: 1.5"/>
    <path d="M 163.572835 264.299286 
L 171.05959 264.299286 
" clip-path="url(#pd13ad75489)" style="fill: none; stroke: #000000; stroke-width: 1.5"/>
    <path d="M 149.777754 206.839655 
L 171.05959 206.839655 
" clip-path="url(#pd13ad75489)" style="fill: none; stroke: #000000; stroke-width: 1.5"/>
    <path d="M 154.684146 233.536667 
L 171.05959 233.536667 
" clip-path="url(#pd13ad75489)" style="fill: none; stroke: #000000; stroke-width: 1.5"/>
    <path d="M 128.762403 271.613745 
L 171.05959 271.613745 
" clip-path="url(#pd13ad75489)" style="fill: none; stroke: #000000; stroke-width: 1.5"/>
    <path d="M 177.636619 179.662622 
L 177.636619 179.662622 
" clip-path="url(#pd13ad75489)" style="fill: none; stroke: #000000; stroke-width: 1.5"/>
    <path d="M 123.514791 134.855751 
L 171.05959 134.855751 
" clip-path="url(#pd13ad75489)" style="fill: none; stroke: #000000; stroke-width: 1.5"/>
    <path d="M 107.656993 137.433808 
L 171.05959 137.433808 
" clip-path="url(#pd13ad75489)" style="fill: none; stroke: #000000; stroke-width: 1.5"/>
    <path d="M 115.98482 130.775632 
L 171.05959 130.775632 
" clip-path="url(#pd13ad75489)" style="fill: none; stroke: #000000; stroke-width: 1.5"/>
    <path d="M 120.695898 86.182259 
L 171.05959 128.542921 
" clip-path="url(#pd13ad75489)" style="fill: none; stroke: #000000; stroke-width: 1.5"/>
    <path d="M 146.154293 115.685595 
L 171.05959 128.542921 
" clip-path="url(#pd13ad75489)" style="fill: none; stroke: #000000; stroke-width: 1.5"/>
    <path d="M 259.41508 209.668334 
L 259.41508 209.668334 
" clip-path="url(#pd13ad75489)" style="fill: none; stroke: #000000; stroke-width: 1.5"/>
    <path d="M 282.324319 273.693109 
L 282.324319 273.693109 
" clip-path="url(#pd13ad75489)" style="fill: none; stroke: #000000; stroke-width: 1.5"/>
    <path d="M 208.976984 259.825364 
L 208.976984 259.825364 
" clip-path="url(#pd13ad75489)" style="fill: none; stroke: #000000; stroke-width: 1.5"/>
    <path d="M 292.106935 177.073137 
L 292.106935 177.073137 
" clip-path="url(#pd13ad75489)" style="fill: none; stroke: #000000; stroke-width: 1.5"/>
    <path d="M 277.735732 200.391913 
L 277.735732 200.391913 
" clip-path="url(#pd13ad75489)" style="fill: none; stroke: #000000; stroke-width: 1.5"/>
    <path d="M 199.393996 95.32496 
L 199.393996 128.542921 
" clip-path="url(#pd13ad75489)" style="fill: none; stroke: #000000; stroke-width: 1.5"/>
    <path d="M 292.754633 167.825465 
L 292.754633 167.825465 
" clip-path="url(#pd13ad75489)" style="fill: none; stroke: #000000; stroke-width: 1.5"/>
    <path d="M 291.732018 96.724339 
L 291.732018 128.542921 
" clip-path="url(#pd13ad75489)" style="fill: none; stroke: #000000; stroke-width: 1.5"/>
    <path d="M 269.133909 159.092794 
L 269.133909 159.092794 
" clip-path="url(#pd13ad75489)" style="fill: none; stroke: #000000; stroke-width: 1.5"/>
    <path d="M 257.774763 79.23076 
L 257.774763 128.542921 
" clip-path="url(#pd13ad75489)" style="fill: none; stroke: #000000; stroke-width: 1.5"/>
    <path d="M 368.386846 198.750652 
L 368.386846 198.750652 
" clip-path="url(#pd13ad75489)" style="fill: none; stroke: #000000; stroke-width: 1.5"/>
    <path d="M 350.065625 280.468027 
L 350.065625 280.468027 
" clip-path="url(#pd13ad75489)" style="fill: none; stroke: #000000; stroke-width: 1.5"/>
    <path d="M 383.871463 195.595672 
L 383.871463 195.595672 
" clip-path="url(#pd13ad75489)" style="fill: none; stroke: #000000; stroke-width: 1.5"/>
    <path d="M 371.871571 210.068447 
L 371.871571 210.068447 
" clip-path="url(#pd13ad75489)" style="fill: none; stroke: #000000; stroke-width: 1.5"/>
    <path d="M 393.042127 202.267359 
L 393.042127 202.267359 
" clip-path="url(#pd13ad75489)" style="fill: none; stroke: #000000; stroke-width: 1.5"/>
    <path d="M 302.721574 95.370523 
L 302.721574 128.542921 
" clip-path="url(#pd13ad75489)" style="fill: none; stroke: #000000; stroke-width: 1.5"/>
    <path d="M 298.652675 166.241052 
L 298.652675 166.241052 
" clip-path="url(#pd13ad75489)" style="fill: none; stroke: #000000; stroke-width: 1.5"/>
    <path d="M 321.897603 113.484401 
L 321.897603 128.542921 
" clip-path="url(#pd13ad75489)" style="fill: none; stroke: #000000; stroke-width: 1.5"/>
    <path d="M 396.398264 90.751994 
L 396.398264 128.542921 
" clip-path="url(#pd13ad75489)" style="fill: none; stroke: #000000; stroke-width: 1.5"/>
    <path d="M 404.599198 285.562188 
L 404.599198 285.562188 
" clip-path="url(#pd13ad75489)" style="fill: none; stroke: #000000; stroke-width: 1.5"/>
    <path d="M 408.761036 273.264329 
L 408.761036 273.264329 
" clip-path="url(#pd13ad75489)" style="fill: none; stroke: #000000; stroke-width: 1.5"/>
    <path d="M 503.473639 254.319022 
L 429.838266 254.319022 
" clip-path="url(#pd13ad75489)" style="fill: none; stroke: #000000; stroke-width: 1.5"/>
    <path d="M 487.881677 246.099814 
L 429.838266 246.099814 
" clip-path="url(#pd13ad75489)" style="fill: none; stroke: #000000; stroke-width: 1.5"/>
    <path d="M 466.440063 195.181155 
L 429.838266 195.181155 
" clip-path="url(#pd13ad75489)" style="fill: none; stroke: #000000; stroke-width: 1.5"/>
    <path d="M 505.852959 255.054626 
L 429.838266 255.054626 
" clip-path="url(#pd13ad75489)" style="fill: none; stroke: #000000; stroke-width: 1.5"/>
    <path d="M 465.282225 144.559616 
L 429.838266 144.559616 
" clip-path="url(#pd13ad75489)" style="fill: none; stroke: #000000; stroke-width: 1.5"/>
    <path d="M 462.397573 180.394698 
L 429.838266 180.394698 
" clip-path="url(#pd13ad75489)" style="fill: none; stroke: #000000; stroke-width: 1.5"/>
    <path d="M 441.929228 159.900083 
L 429.838266 159.900083 
" clip-path="url(#pd13ad75489)" style="fill: none; stroke: #000000; stroke-width: 1.5"/>
    <path d="M 468.796019 144.295122 
L 429.838266 144.295122 
" clip-path="url(#pd13ad75489)" style="fill: none; stroke: #000000; stroke-width: 1.5"/>
    <path d="M 478.294424 176.624853 
L 429.838266 176.624853 
" clip-path="url(#pd13ad75489)" style="fill: none; stroke: #000000; stroke-width: 1.5"/>
    <path d="M 476.097119 184.333518 
L 429.838266 184.333518 
" clip-path="url(#pd13ad75489)" style="fill: none; stroke: #000000; stroke-width: 1.5"/>
    <path d="M 496.975751 171.371109 
L 429.838266 171.371109 
" clip-path="url(#pd13ad75489)" style="fill: none; stroke: #000000; stroke-width: 1.5"/>
    <path d="M 439.29874 92.331658 
L 429.838266 128.542921 
" clip-path="url(#pd13ad75489)" style="fill: none; stroke: #000000; stroke-width: 1.5"/>
    <path d="M 425.328376 83.688288 
L 425.328376 128.542921 
" clip-path="url(#pd13ad75489)" style="fill: none; stroke: #000000; stroke-width: 1.5"/>
    <path d="M 461.802814 84.506321 
L 429.838266 128.542921 
" clip-path="url(#pd13ad75489)" style="fill: none; stroke: #000000; stroke-width: 1.5"/>
    <path d="M 445.799372 95.968936 
L 429.838266 128.542921 
" clip-path="url(#pd13ad75489)" style="fill: none; stroke: #000000; stroke-width: 1.5"/>
   </g>
   <g id="patch_2">
    <path d="M 171.05959 378.45956 
L 429.838266 378.45956 
L 429.838266 128.542921 
L 171.05959 128.542921 
z
" clip-path="url(#pd13ad75489)" style="fill: #d2bfba"/>
   </g>
   <g id="patch_3">
    <path d="M 171.05959 378.45956 
L 429.838266 378.45956 
L 429.838266 128.542921 
L 171.05959 128.542921 
L 171.05959 378.45956 
z
" clip-path="url(#pd13ad75489)" style="fill: none; stroke: #c76d57; stroke-linejoin: miter"/>
   </g>
   <g id="PathCollection_1">
    <defs>
     <path id="C0_0_3aaf81e024" d="M 0 3 
C 0.795609 3 1.55874 2.683901 2.12132 2.12132 
C 2.683901 1.55874 3 0.795609 3 -0 
C 3 -0.795609 2.683901 -1.55874 2.12132 -2.12132 
C 1.55874 -2.683901 0.795609 -3 0 -3 
C -0.795609 -3 -1.55874 -2.683901 -2.12132 -2.12132 
C -2.683901 -1.55874 -3 -0.795609 -3 0 
C -3 0.795609 -2.683901 1.55874 -2.12132 2.12132 
C -1.55874 2.683901 -0.795609 3 0 3 
z
"/>
    </defs>
    <g clip-path="url(#pd13ad75489)">
     <use xlink:href="#C0_0_3aaf81e024" x="98.837064" y="461.701499" style="fill: #c85e64; stroke: #000000"/>
    </g>
    <g clip-path="url(#pd13ad75489)">
     <use xlink:href="#C0_0_3aaf81e024" x="153.896433" y="418.522175" style="fill: #c2a673; stroke: #000000"/>
    </g>
    <g clip-path="url(#pd13ad75489)">
     <use xlink:href="#C0_0_3aaf81e024" x="112.924197" y="460.206939" style="fill: #d2e66f; stroke: #000000"/>
    </g>
    <g clip-path="url(#pd13ad75489)">
     <use xlink:href="#C0_0_3aaf81e024" x="80.250723" y="479.456487" style="fill: #6fa8d5; stroke: #000000"/>
    </g>
    <g clip-path="url(#pd13ad75489)">
     <use xlink:href="#C0_0_3aaf81e024" x="86.83259" y="439.348178" style="fill: #5ac953; stroke: #000000"/>
    </g>
    <g clip-path="url(#pd13ad75489)">
     <use xlink:href="#C0_0_3aaf81e024" x="181.700651" y="459.89011" style="fill: #b376ce; stroke: #000000"/>
    </g>
    <g clip-path="url(#pd13ad75489)">
     <use xlink:href="#C0_0_3aaf81e024" x="241.557717" y="421.371545" style="fill: #ec8061; stroke: #000000"/>
    </g>
    <g clip-path="url(#pd13ad75489)">
     <use xlink:href="#C0_0_3aaf81e024" x="211.944505" y="502.244829" style="fill: #61b84e; stroke: #000000"/>
    </g>
    <g clip-path="url(#pd13ad75489)">
     <use xlink:href="#C0_0_3aaf81e024" x="175.259285" y="502.485151" style="fill: #8081ef; stroke: #000000"/>
    </g>
    <g clip-path="url(#pd13ad75489)">
     <use xlink:href="#C0_0_3aaf81e024" x="199.946609" y="436.049955" style="fill: #60e5d4; stroke: #000000"/>
    </g>
    <g clip-path="url(#pd13ad75489)">
     <use xlink:href="#C0_0_3aaf81e024" x="100.044508" y="348.914792" style="fill: #8de475; stroke: #000000"/>
    </g>
    <g clip-path="url(#pd13ad75489)">
     <use xlink:href="#C0_0_3aaf81e024" x="90.485849" y="357.858907" style="fill: #62d994; stroke: #000000"/>
    </g>
    <g clip-path="url(#pd13ad75489)">
     <use xlink:href="#C0_0_3aaf81e024" x="93.946764" y="297.889938" style="fill: #718cf7; stroke: #000000"/>
    </g>
    <g clip-path="url(#pd13ad75489)">
     <use xlink:href="#C0_0_3aaf81e024" x="132.055229" y="309.932686" style="fill: #8eedbd; stroke: #000000"/>
    </g>
    <g clip-path="url(#pd13ad75489)">
     <use xlink:href="#C0_0_3aaf81e024" x="119.91706" y="316.702823" style="fill: #926ed2; stroke: #000000"/>
    </g>
    <g clip-path="url(#pd13ad75489)">
     <use xlink:href="#C0_0_3aaf81e024" x="103.371101" y="306.724839" style="fill: #6585f3; stroke: #000000"/>
    </g>
    <g clip-path="url(#pd13ad75489)">
     <use xlink:href="#C0_0_3aaf81e024" x="177.538234" y="302.815157" style="fill: #d669dd; stroke: #000000"/>
    </g>
    <g clip-path="url(#pd13ad75489)">
     <use xlink:href="#C0_0_3aaf81e024" x="182.463558" y="380.680711" style="fill: #d678c4; stroke: #000000"/>
    </g>
    <g clip-path="url(#pd13ad75489)">
     <use xlink:href="#C0_0_3aaf81e024" x="253.052369" y="309.601442" style="fill: #d65763; stroke: #000000"/>
    </g>
    <g clip-path="url(#pd13ad75489)">
     <use xlink:href="#C0_0_3aaf81e024" x="240.441987" y="371.528976" style="fill: #72d3bb; stroke: #000000"/>
    </g>
    <g clip-path="url(#pd13ad75489)">
     <use xlink:href="#C0_0_3aaf81e024" x="240.392128" y="387.067743" style="fill: #6684c6; stroke: #000000"/>
    </g>
    <g clip-path="url(#pd13ad75489)">
     <use xlink:href="#C0_0_3aaf81e024" x="252.098001" y="392.791084" style="fill: #c663b5; stroke: #000000"/>
    </g>
    <g clip-path="url(#pd13ad75489)">
     <use xlink:href="#C0_0_3aaf81e024" x="273.595054" y="340.046011" style="fill: #badf5f; stroke: #000000"/>
    </g>
    <g clip-path="url(#pd13ad75489)">
     <use xlink:href="#C0_0_3aaf81e024" x="336.045808" y="478.070293" style="fill: #a57bef; stroke: #000000"/>
    </g>
    <g clip-path="url(#pd13ad75489)">
     <use xlink:href="#C0_0_3aaf81e024" x="328.398399" y="431.600242" style="fill: #72e495; stroke: #000000"/>
    </g>
    <g clip-path="url(#pd13ad75489)">
     <use xlink:href="#C0_0_3aaf81e024" x="378.527355" y="425.414754" style="fill: #766bf8; stroke: #000000"/>
    </g>
    <g clip-path="url(#pd13ad75489)">
     <use xlink:href="#C0_0_3aaf81e024" x="366.577489" y="484.049654" style="fill: #66b8de; stroke: #000000"/>
    </g>
    <g clip-path="url(#pd13ad75489)">
     <use xlink:href="#C0_0_3aaf81e024" x="394.272499" y="463.084757" style="fill: #e2fd82; stroke: #000000"/>
    </g>
    <g clip-path="url(#pd13ad75489)">
     <use xlink:href="#C0_0_3aaf81e024" x="368.080449" y="445.765509" style="fill: #63c196; stroke: #000000"/>
    </g>
    <g clip-path="url(#pd13ad75489)">
     <use xlink:href="#C0_0_3aaf81e024" x="452.112344" y="506.037643" style="fill: #985cb9; stroke: #000000"/>
    </g>
    <g clip-path="url(#pd13ad75489)">
     <use xlink:href="#C0_0_3aaf81e024" x="431.778696" y="459.174053" style="fill: #86f47e; stroke: #000000"/>
    </g>
    <g clip-path="url(#pd13ad75489)">
     <use xlink:href="#C0_0_3aaf81e024" x="415.638483" y="471.829935" style="fill: #d09676; stroke: #000000"/>
    </g>
    <g clip-path="url(#pd13ad75489)">
     <use xlink:href="#C0_0_3aaf81e024" x="447.543702" y="467.732341" style="fill: #c68cec; stroke: #000000"/>
    </g>
    <g clip-path="url(#pd13ad75489)">
     <use xlink:href="#C0_0_3aaf81e024" x="502.051017" y="450.973282" style="fill: #f5806a; stroke: #000000"/>
    </g>
    <g clip-path="url(#pd13ad75489)">
     <use xlink:href="#C0_0_3aaf81e024" x="461.2001" y="472.805628" style="fill: #b870ef; stroke: #000000"/>
    </g>
    <g clip-path="url(#pd13ad75489)">
     <use xlink:href="#C0_0_3aaf81e024" x="499.772102" y="447.071089" style="fill: #8293e2; stroke: #000000"/>
    </g>
    <g clip-path="url(#pd13ad75489)">
     <use xlink:href="#C0_0_3aaf81e024" x="297.138234" y="368.514781" style="fill: #deb081; stroke: #000000"/>
    </g>
    <g clip-path="url(#pd13ad75489)">
     <use xlink:href="#C0_0_3aaf81e024" x="331.537955" y="367.893693" style="fill: #b390fb; stroke: #000000"/>
    </g>
    <g clip-path="url(#pd13ad75489)">
     <use xlink:href="#C0_0_3aaf81e024" x="293.677556" y="294.777339" style="fill: #66c270; stroke: #000000"/>
    </g>
    <g clip-path="url(#pd13ad75489)">
     <use xlink:href="#C0_0_3aaf81e024" x="380.174508" y="343.39792" style="fill: #83e0ea; stroke: #000000"/>
    </g>
    <g clip-path="url(#pd13ad75489)">
     <use xlink:href="#C0_0_3aaf81e024" x="389.431775" y="294.704822" style="fill: #d6827d; stroke: #000000"/>
    </g>
    <g clip-path="url(#pd13ad75489)">
     <use xlink:href="#C0_0_3aaf81e024" x="343.908618" y="297.411902" style="fill: #6691b5; stroke: #000000"/>
    </g>
    <g clip-path="url(#pd13ad75489)">
     <use xlink:href="#C0_0_3aaf81e024" x="367.496902" y="349.379261" style="fill: #58ce90; stroke: #000000"/>
    </g>
    <g clip-path="url(#pd13ad75489)">
     <use xlink:href="#C0_0_3aaf81e024" x="459.497985" y="384.818668" style="fill: #dfc882; stroke: #000000"/>
    </g>
    <g clip-path="url(#pd13ad75489)">
     <use xlink:href="#C0_0_3aaf81e024" x="466.040786" y="348.271692" style="fill: #e28d75; stroke: #000000"/>
    </g>
    <g clip-path="url(#pd13ad75489)">
     <use xlink:href="#C0_0_3aaf81e024" x="441.588257" y="327.417881" style="fill: #90f9ab; stroke: #000000"/>
    </g>
    <g clip-path="url(#pd13ad75489)">
     <use xlink:href="#C0_0_3aaf81e024" x="502.464674" y="298.562778" style="fill: #69e8a7; stroke: #000000"/>
    </g>
    <g clip-path="url(#pd13ad75489)">
     <use xlink:href="#C0_0_3aaf81e024" x="471.022932" y="295.289251" style="fill: #5ab8bd; stroke: #000000"/>
    </g>
    <g clip-path="url(#pd13ad75489)">
     <use xlink:href="#C0_0_3aaf81e024" x="491.422984" y="318.76773" style="fill: #7c94e0; stroke: #000000"/>
    </g>
    <g clip-path="url(#pd13ad75489)">
     <use xlink:href="#C0_0_3aaf81e024" x="437.560835" y="316.903991" style="fill: #d7d57f; stroke: #000000"/>
    </g>
    <g clip-path="url(#pd13ad75489)">
     <use xlink:href="#C0_0_3aaf81e024" x="82.842291" y="263.650956" style="fill: #fb7f81; stroke: #000000"/>
    </g>
    <g clip-path="url(#pd13ad75489)">
     <use xlink:href="#C0_0_3aaf81e024" x="92.793266" y="240.210388" style="fill: #b059cb; stroke: #000000"/>
    </g>
    <g clip-path="url(#pd13ad75489)">
     <use xlink:href="#C0_0_3aaf81e024" x="98.690096" y="275.53072" style="fill: #8fa5f3; stroke: #000000"/>
    </g>
    <g clip-path="url(#pd13ad75489)">
     <use xlink:href="#C0_0_3aaf81e024" x="152.940897" y="196.335239" style="fill: #b974e7; stroke: #000000"/>
    </g>
    <g clip-path="url(#pd13ad75489)">
     <use xlink:href="#C0_0_3aaf81e024" x="163.572835" y="264.299286" style="fill: #80a1f6; stroke: #000000"/>
    </g>
    <g clip-path="url(#pd13ad75489)">
     <use xlink:href="#C0_0_3aaf81e024" x="149.777754" y="206.839655" style="fill: #8cc868; stroke: #000000"/>
    </g>
    <g clip-path="url(#pd13ad75489)">
     <use xlink:href="#C0_0_3aaf81e024" x="154.684146" y="233.536667" style="fill: #6060b4; stroke: #000000"/>
    </g>
    <g clip-path="url(#pd13ad75489)">
     <use xlink:href="#C0_0_3aaf81e024" x="128.762403" y="271.613745" style="fill: #62b0bf; stroke: #000000"/>
    </g>
    <g clip-path="url(#pd13ad75489)">
     <use xlink:href="#C0_0_3aaf81e024" x="177.636619" y="179.662622" style="fill: #d9635e; stroke: #000000"/>
    </g>
    <g clip-path="url(#pd13ad75489)">
     <use xlink:href="#C0_0_3aaf81e024" x="123.514791" y="134.855751" style="fill: #526dc6; stroke: #000000"/>
    </g>
    <g clip-path="url(#pd13ad75489)">
     <use xlink:href="#C0_0_3aaf81e024" x="107.656993" y="137.433808" style="fill: #bf5884; stroke: #000000"/>
    </g>
    <g clip-path="url(#pd13ad75489)">
     <use xlink:href="#C0_0_3aaf81e024" x="115.98482" y="130.775632" style="fill: #71ba6c; stroke: #000000"/>
    </g>
    <g clip-path="url(#pd13ad75489)">
     <use xlink:href="#C0_0_3aaf81e024" x="120.695898" y="86.182259" style="fill: #c37c57; stroke: #000000"/>
    </g>
    <g clip-path="url(#pd13ad75489)">
     <use xlink:href="#C0_0_3aaf81e024" x="146.154293" y="115.685595" style="fill: #f2c86b; stroke: #000000"/>
    </g>
    <g clip-path="url(#pd13ad75489)">
     <use xlink:href="#C0_0_3aaf81e024" x="259.41508" y="209.668334" style="fill: #91e3f7; stroke: #000000"/>
    </g>
    <g clip-path="url(#pd13ad75489)">
     <use xlink:href="#C0_0_3aaf81e024" x="282.324319" y="273.693109" style="fill: #e4b263; stroke: #000000"/>
    </g>
    <g clip-path="url(#pd13ad75489)">
     <use xlink:href="#C0_0_3aaf81e024" x="208.976984" y="259.825364" style="fill: #67c1e2; stroke: #000000"/>
    </g>
    <g clip-path="url(#pd13ad75489)">
     <use xlink:href="#C0_0_3aaf81e024" x="292.106935" y="177.073137" style="fill: #abfd6e; stroke: #000000"/>
    </g>
    <g clip-path="url(#pd13ad75489)">
     <use xlink:href="#C0_0_3aaf81e024" x="277.735732" y="200.391913" style="fill: #e16078; stroke: #000000"/>
    </g>
    <g clip-path="url(#pd13ad75489)">
     <use xlink:href="#C0_0_3aaf81e024" x="199.393996" y="95.32496" style="fill: #72b54b; stroke: #000000"/>
    </g>
    <g clip-path="url(#pd13ad75489)">
     <use xlink:href="#C0_0_3aaf81e024" x="292.754633" y="167.825465" style="fill: #f374ec; stroke: #000000"/>
    </g>
    <g clip-path="url(#pd13ad75489)">
     <use xlink:href="#C0_0_3aaf81e024" x="291.732018" y="96.724339" style="fill: #a7bf5d; stroke: #000000"/>
    </g>
    <g clip-path="url(#pd13ad75489)">
     <use xlink:href="#C0_0_3aaf81e024" x="269.133909" y="159.092794" style="fill: #b9a05b; stroke: #000000"/>
    </g>
    <g clip-path="url(#pd13ad75489)">
     <use xlink:href="#C0_0_3aaf81e024" x="257.774763" y="79.23076" style="fill: #55a1bd; stroke: #000000"/>
    </g>
    <g clip-path="url(#pd13ad75489)">
     <use xlink:href="#C0_0_3aaf81e024" x="368.386846" y="198.750652" style="fill: #8dea68; stroke: #000000"/>
    </g>
    <g clip-path="url(#pd13ad75489)">
     <use xlink:href="#C0_0_3aaf81e024" x="350.065625" y="280.468027" style="fill: #6b55b8; stroke: #000000"/>
    </g>
    <g clip-path="url(#pd13ad75489)">
     <use xlink:href="#C0_0_3aaf81e024" x="383.871463" y="195.595672" style="fill: #709acd; stroke: #000000"/>
    </g>
    <g clip-path="url(#pd13ad75489)">
     <use xlink:href="#C0_0_3aaf81e024" x="371.871571" y="210.068447" style="fill: #b9a24f; stroke: #000000"/>
    </g>
    <g clip-path="url(#pd13ad75489)">
     <use xlink:href="#C0_0_3aaf81e024" x="393.042127" y="202.267359" style="fill: #4a96b6; stroke: #000000"/>
    </g>
    <g clip-path="url(#pd13ad75489)">
     <use xlink:href="#C0_0_3aaf81e024" x="302.721574" y="95.370523" style="fill: #70f9bd; stroke: #000000"/>
    </g>
    <g clip-path="url(#pd13ad75489)">
     <use xlink:href="#C0_0_3aaf81e024" x="298.652675" y="166.241052" style="fill: #d472c0; stroke: #000000"/>
    </g>
    <g clip-path="url(#pd13ad75489)">
     <use xlink:href="#C0_0_3aaf81e024" x="321.897603" y="113.484401" style="fill: #a990f9; stroke: #000000"/>
    </g>
    <g clip-path="url(#pd13ad75489)">
     <use xlink:href="#C0_0_3aaf81e024" x="396.398264" y="90.751994" style="fill: #9b59d1; stroke: #000000"/>
    </g>
    <g clip-path="url(#pd13ad75489)">
     <use xlink:href="#C0_0_3aaf81e024" x="404.599198" y="285.562188" style="fill: #7f4db6; stroke: #000000"/>
    </g>
    <g clip-path="url(#pd13ad75489)">
     <use xlink:href="#C0_0_3aaf81e024" x="408.761036" y="273.264329" style="fill: #768af8; stroke: #000000"/>
    </g>
    <g clip-path="url(#pd13ad75489)">
     <use xlink:href="#C0_0_3aaf81e024" x="503.473639" y="254.319022" style="fill: #6dc8bd; stroke: #000000"/>
    </g>
    <g clip-path="url(#pd13ad75489)">
     <use xlink:href="#C0_0_3aaf81e024" x="487.881677" y="246.099814" style="fill: #c45450; stroke: #000000"/>
    </g>
    <g clip-path="url(#pd13ad75489)">
     <use xlink:href="#C0_0_3aaf81e024" x="466.440063" y="195.181155" style="fill: #add067; stroke: #000000"/>
    </g>
    <g clip-path="url(#pd13ad75489)">
     <use xlink:href="#C0_0_3aaf81e024" x="505.852959" y="255.054626" style="fill: #d5c06c; stroke: #000000"/>
    </g>
    <g clip-path="url(#pd13ad75489)">
     <use xlink:href="#C0_0_3aaf81e024" x="465.282225" y="144.559616" style="fill: #9ad46f; stroke: #000000"/>
    </g>
    <g clip-path="url(#pd13ad75489)">
     <use xlink:href="#C0_0_3aaf81e024" x="462.397573" y="180.394698" style="fill: #715ce6; stroke: #000000"/>
    </g>
    <g clip-path="url(#pd13ad75489)">
     <use xlink:href="#C0_0_3aaf81e024" x="441.929228" y="159.900083" style="fill: #65be6b; stroke: #000000"/>
    </g>
    <g clip-path="url(#pd13ad75489)">
     <use xlink:href="#C0_0_3aaf81e024" x="468.796019" y="144.295122" style="fill: #6271bd; stroke: #000000"/>
    </g>
    <g clip-path="url(#pd13ad75489)">
     <use xlink:href="#C0_0_3aaf81e024" x="478.294424" y="176.624853" style="fill: #df986e; stroke: #000000"/>
    </g>
    <g clip-path="url(#pd13ad75489)">
     <use xlink:href="#C0_0_3aaf81e024" x="476.097119" y="184.333518" style="fill: #c55754; stroke: #000000"/>
    </g>
    <g clip-path="url(#pd13ad75489)">
     <use xlink:href="#C0_0_3aaf81e024" x="496.975751" y="171.371109" style="fill: #fa7273; stroke: #000000"/>
    </g>
    <g clip-path="url(#pd13ad75489)">
     <use xlink:href="#C0_0_3aaf81e024" x="439.29874" y="92.331658" style="fill: #fad483; stroke: #000000"/>
    </g>
    <g clip-path="url(#pd13ad75489)">
     <use xlink:href="#C0_0_3aaf81e024" x="425.328376" y="83.688288" style="fill: #f39e91; stroke: #000000"/>
    </g>
    <g clip-path="url(#pd13ad75489)">
     <use xlink:href="#C0_0_3aaf81e024" x="461.802814" y="84.506321" style="fill: #7ded9d; stroke: #000000"/>
    </g>
    <g clip-path="url(#pd13ad75489)">
     <use xlink:href="#C0_0_3aaf81e024" x="445.799372" y="95.968936" style="fill: #f9c791; stroke: #000000"/>
    </g>
   </g>
   <g id="PathCollection_2">
    <defs>
     <path id="C1_0_5889f4d75c" d="M 0 3 
C 0.795609 3 1.55874 2.683901 2.12132 2.12132 
C 2.683901 1.55874 3 0.795609 3 -0 
C 3 -0.795609 2.683901 -1.55874 2.12132 -2.12132 
C 1.55874 -2.683901 0.795609 -3 0 -3 
C -0.795609 -3 -1.55874 -2.683901 -2.12132 -2.12132 
C -2.683901 -1.55874 -3 -0.795609 -3 0 
C -3 0.795609 -2.683901 1.55874 -2.12132 2.12132 
C -1.55874 2.683901 -0.795609 3 0 3 
z
"/>
    </defs>
    <g clip-path="url(#pd13ad75489)">
     <use xlink:href="#C1_0_5889f4d75c" x="171.05959" y="378.45956" style="fill: #c85e64; stroke: #000000"/>
    </g>
    <g clip-path="url(#pd13ad75489)">
     <use xlink:href="#C1_0_5889f4d75c" x="171.05959" y="378.45956" style="fill: #c2a673; stroke: #000000"/>
    </g>
    <g clip-path="url(#pd13ad75489)">
     <use xlink:href="#C1_0_5889f4d75c" x="171.05959" y="378.45956" style="fill: #d2e66f; stroke: #000000"/>
    </g>
    <g clip-path="url(#pd13ad75489)">
     <use xlink:href="#C1_0_5889f4d75c" x="171.05959" y="378.45956" style="fill: #6fa8d5; stroke: #000000"/>
    </g>
    <g clip-path="url(#pd13ad75489)">
     <use xlink:href="#C1_0_5889f4d75c" x="171.05959" y="378.45956" style="fill: #5ac953; stroke: #000000"/>
    </g>
    <g clip-path="url(#pd13ad75489)">
     <use xlink:href="#C1_0_5889f4d75c" x="181.700651" y="378.45956" style="fill: #b376ce; stroke: #000000"/>
    </g>
    <g clip-path="url(#pd13ad75489)">
     <use xlink:href="#C1_0_5889f4d75c" x="241.557717" y="378.45956" style="fill: #ec8061; stroke: #000000"/>
    </g>
    <g clip-path="url(#pd13ad75489)">
     <use xlink:href="#C1_0_5889f4d75c" x="211.944505" y="378.45956" style="fill: #61b84e; stroke: #000000"/>
    </g>
    <g clip-path="url(#pd13ad75489)">
     <use xlink:href="#C1_0_5889f4d75c" x="175.259285" y="378.45956" style="fill: #8081ef; stroke: #000000"/>
    </g>
    <g clip-path="url(#pd13ad75489)">
     <use xlink:href="#C1_0_5889f4d75c" x="199.946609" y="378.45956" style="fill: #60e5d4; stroke: #000000"/>
    </g>
    <g clip-path="url(#pd13ad75489)">
     <use xlink:href="#C1_0_5889f4d75c" x="171.05959" y="348.914792" style="fill: #8de475; stroke: #000000"/>
    </g>
    <g clip-path="url(#pd13ad75489)">
     <use xlink:href="#C1_0_5889f4d75c" x="171.05959" y="357.858907" style="fill: #62d994; stroke: #000000"/>
    </g>
    <g clip-path="url(#pd13ad75489)">
     <use xlink:href="#C1_0_5889f4d75c" x="171.05959" y="297.889938" style="fill: #718cf7; stroke: #000000"/>
    </g>
    <g clip-path="url(#pd13ad75489)">
     <use xlink:href="#C1_0_5889f4d75c" x="171.05959" y="309.932686" style="fill: #8eedbd; stroke: #000000"/>
    </g>
    <g clip-path="url(#pd13ad75489)">
     <use xlink:href="#C1_0_5889f4d75c" x="171.05959" y="316.702823" style="fill: #926ed2; stroke: #000000"/>
    </g>
    <g clip-path="url(#pd13ad75489)">
     <use xlink:href="#C1_0_5889f4d75c" x="171.05959" y="306.724839" style="fill: #6585f3; stroke: #000000"/>
    </g>
    <g clip-path="url(#pd13ad75489)">
     <use xlink:href="#C1_0_5889f4d75c" x="177.538234" y="302.815157" style="fill: #d669dd; stroke: #000000"/>
    </g>
    <g clip-path="url(#pd13ad75489)">
     <use xlink:href="#C1_0_5889f4d75c" x="182.463558" y="378.45956" style="fill: #d678c4; stroke: #000000"/>
    </g>
    <g clip-path="url(#pd13ad75489)">
     <use xlink:href="#C1_0_5889f4d75c" x="253.052369" y="309.601442" style="fill: #d65763; stroke: #000000"/>
    </g>
    <g clip-path="url(#pd13ad75489)">
     <use xlink:href="#C1_0_5889f4d75c" x="240.441987" y="371.528976" style="fill: #72d3bb; stroke: #000000"/>
    </g>
    <g clip-path="url(#pd13ad75489)">
     <use xlink:href="#C1_0_5889f4d75c" x="240.392128" y="378.45956" style="fill: #6684c6; stroke: #000000"/>
    </g>
    <g clip-path="url(#pd13ad75489)">
     <use xlink:href="#C1_0_5889f4d75c" x="252.098001" y="378.45956" style="fill: #c663b5; stroke: #000000"/>
    </g>
    <g clip-path="url(#pd13ad75489)">
     <use xlink:href="#C1_0_5889f4d75c" x="273.595054" y="340.046011" style="fill: #badf5f; stroke: #000000"/>
    </g>
    <g clip-path="url(#pd13ad75489)">
     <use xlink:href="#C1_0_5889f4d75c" x="336.045808" y="378.45956" style="fill: #a57bef; stroke: #000000"/>
    </g>
    <g clip-path="url(#pd13ad75489)">
     <use xlink:href="#C1_0_5889f4d75c" x="328.398399" y="378.45956" style="fill: #72e495; stroke: #000000"/>
    </g>
    <g clip-path="url(#pd13ad75489)">
     <use xlink:href="#C1_0_5889f4d75c" x="378.527355" y="378.45956" style="fill: #766bf8; stroke: #000000"/>
    </g>
    <g clip-path="url(#pd13ad75489)">
     <use xlink:href="#C1_0_5889f4d75c" x="366.577489" y="378.45956" style="fill: #66b8de; stroke: #000000"/>
    </g>
    <g clip-path="url(#pd13ad75489)">
     <use xlink:href="#C1_0_5889f4d75c" x="394.272499" y="378.45956" style="fill: #e2fd82; stroke: #000000"/>
    </g>
    <g clip-path="url(#pd13ad75489)">
     <use xlink:href="#C1_0_5889f4d75c" x="368.080449" y="378.45956" style="fill: #63c196; stroke: #000000"/>
    </g>
    <g clip-path="url(#pd13ad75489)">
     <use xlink:href="#C1_0_5889f4d75c" x="429.838266" y="378.45956" style="fill: #985cb9; stroke: #000000"/>
    </g>
    <g clip-path="url(#pd13ad75489)">
     <use xlink:href="#C1_0_5889f4d75c" x="429.838266" y="378.45956" style="fill: #86f47e; stroke: #000000"/>
    </g>
    <g clip-path="url(#pd13ad75489)">
     <use xlink:href="#C1_0_5889f4d75c" x="415.638483" y="378.45956" style="fill: #d09676; stroke: #000000"/>
    </g>
    <g clip-path="url(#pd13ad75489)">
     <use xlink:href="#C1_0_5889f4d75c" x="429.838266" y="378.45956" style="fill: #c68cec; stroke: #000000"/>
    </g>
    <g clip-path="url(#pd13ad75489)">
     <use xlink:href="#C1_0_5889f4d75c" x="429.838266" y="378.45956" style="fill: #f5806a; stroke: #000000"/>
    </g>
    <g clip-path="url(#pd13ad75489)">
     <use xlink:href="#C1_0_5889f4d75c" x="429.838266" y="378.45956" style="fill: #b870ef; stroke: #000000"/>
    </g>
    <g clip-path="url(#pd13ad75489)">
     <use xlink:href="#C1_0_5889f4d75c" x="429.838266" y="378.45956" style="fill: #8293e2; stroke: #000000"/>
    </g>
    <g clip-path="url(#pd13ad75489)">
     <use xlink:href="#C1_0_5889f4d75c" x="297.138234" y="368.514781" style="fill: #deb081; stroke: #000000"/>
    </g>
    <g clip-path="url(#pd13ad75489)">
     <use xlink:href="#C1_0_5889f4d75c" x="331.537955" y="367.893693" style="fill: #b390fb; stroke: #000000"/>
    </g>
    <g clip-path="url(#pd13ad75489)">
     <use xlink:href="#C1_0_5889f4d75c" x="293.677556" y="294.777339" style="fill: #66c270; stroke: #000000"/>
    </g>
    <g clip-path="url(#pd13ad75489)">
     <use xlink:href="#C1_0_5889f4d75c" x="380.174508" y="343.39792" style="fill: #83e0ea; stroke: #000000"/>
    </g>
    <g clip-path="url(#pd13ad75489)">
     <use xlink:href="#C1_0_5889f4d75c" x="389.431775" y="294.704822" style="fill: #d6827d; stroke: #000000"/>
    </g>
    <g clip-path="url(#pd13ad75489)">
     <use xlink:href="#C1_0_5889f4d75c" x="343.908618" y="297.411902" style="fill: #6691b5; stroke: #000000"/>
    </g>
    <g clip-path="url(#pd13ad75489)">
     <use xlink:href="#C1_0_5889f4d75c" x="367.496902" y="349.379261" style="fill: #58ce90; stroke: #000000"/>
    </g>
    <g clip-path="url(#pd13ad75489)">
     <use xlink:href="#C1_0_5889f4d75c" x="429.838266" y="378.45956" style="fill: #dfc882; stroke: #000000"/>
    </g>
    <g clip-path="url(#pd13ad75489)">
     <use xlink:href="#C1_0_5889f4d75c" x="429.838266" y="348.271692" style="fill: #e28d75; stroke: #000000"/>
    </g>
    <g clip-path="url(#pd13ad75489)">
     <use xlink:href="#C1_0_5889f4d75c" x="429.838266" y="327.417881" style="fill: #90f9ab; stroke: #000000"/>
    </g>
    <g clip-path="url(#pd13ad75489)">
     <use xlink:href="#C1_0_5889f4d75c" x="429.838266" y="298.562778" style="fill: #69e8a7; stroke: #000000"/>
    </g>
    <g clip-path="url(#pd13ad75489)">
     <use xlink:href="#C1_0_5889f4d75c" x="429.838266" y="295.289251" style="fill: #5ab8bd; stroke: #000000"/>
    </g>
    <g clip-path="url(#pd13ad75489)">
     <use xlink:href="#C1_0_5889f4d75c" x="429.838266" y="318.76773" style="fill: #7c94e0; stroke: #000000"/>
    </g>
    <g clip-path="url(#pd13ad75489)">
     <use xlink:href="#C1_0_5889f4d75c" x="429.838266" y="316.903991" style="fill: #d7d57f; stroke: #000000"/>
    </g>
    <g clip-path="url(#pd13ad75489)">
     <use xlink:href="#C1_0_5889f4d75c" x="171.05959" y="263.650956" style="fill: #fb7f81; stroke: #000000"/>
    </g>
    <g clip-path="url(#pd13ad75489)">
     <use xlink:href="#C1_0_5889f4d75c" x="171.05959" y="240.210388" style="fill: #b059cb; stroke: #000000"/>
    </g>
    <g clip-path="url(#pd13ad75489)">
     <use xlink:href="#C1_0_5889f4d75c" x="171.05959" y="275.53072" style="fill: #8fa5f3; stroke: #000000"/>
    </g>
    <g clip-path="url(#pd13ad75489)">
     <use xlink:href="#C1_0_5889f4d75c" x="171.05959" y="196.335239" style="fill: #b974e7; stroke: #000000"/>
    </g>
    <g clip-path="url(#pd13ad75489)">
     <use xlink:href="#C1_0_5889f4d75c" x="171.05959" y="264.299286" style="fill: #80a1f6; stroke: #000000"/>
    </g>
    <g clip-path="url(#pd13ad75489)">
     <use xlink:href="#C1_0_5889f4d75c" x="171.05959" y="206.839655" style="fill: #8cc868; stroke: #000000"/>
    </g>
    <g clip-path="url(#pd13ad75489)">
     <use xlink:href="#C1_0_5889f4d75c" x="171.05959" y="233.536667" style="fill: #6060b4; stroke: #000000"/>
    </g>
    <g clip-path="url(#pd13ad75489)">
     <use xlink:href="#C1_0_5889f4d75c" x="171.05959" y="271.613745" style="fill: #62b0bf; stroke: #000000"/>
    </g>
    <g clip-path="url(#pd13ad75489)">
     <use xlink:href="#C1_0_5889f4d75c" x="177.636619" y="179.662622" style="fill: #d9635e; stroke: #000000"/>
    </g>
    <g clip-path="url(#pd13ad75489)">
     <use xlink:href="#C1_0_5889f4d75c" x="171.05959" y="134.855751" style="fill: #526dc6; stroke: #000000"/>
    </g>
    <g clip-path="url(#pd13ad75489)">
     <use xlink:href="#C1_0_5889f4d75c" x="171.05959" y="137.433808" style="fill: #bf5884; stroke: #000000"/>
    </g>
    <g clip-path="url(#pd13ad75489)">
     <use xlink:href="#C1_0_5889f4d75c" x="171.05959" y="130.775632" style="fill: #71ba6c; stroke: #000000"/>
    </g>
    <g clip-path="url(#pd13ad75489)">
     <use xlink:href="#C1_0_5889f4d75c" x="171.05959" y="128.542921" style="fill: #c37c57; stroke: #000000"/>
    </g>
    <g clip-path="url(#pd13ad75489)">
     <use xlink:href="#C1_0_5889f4d75c" x="171.05959" y="128.542921" style="fill: #f2c86b; stroke: #000000"/>
    </g>
    <g clip-path="url(#pd13ad75489)">
     <use xlink:href="#C1_0_5889f4d75c" x="259.41508" y="209.668334" style="fill: #91e3f7; stroke: #000000"/>
    </g>
    <g clip-path="url(#pd13ad75489)">
     <use xlink:href="#C1_0_5889f4d75c" x="282.324319" y="273.693109" style="fill: #e4b263; stroke: #000000"/>
    </g>
    <g clip-path="url(#pd13ad75489)">
     <use xlink:href="#C1_0_5889f4d75c" x="208.976984" y="259.825364" style="fill: #67c1e2; stroke: #000000"/>
    </g>
    <g clip-path="url(#pd13ad75489)">
     <use xlink:href="#C1_0_5889f4d75c" x="292.106935" y="177.073137" style="fill: #abfd6e; stroke: #000000"/>
    </g>
    <g clip-path="url(#pd13ad75489)">
     <use xlink:href="#C1_0_5889f4d75c" x="277.735732" y="200.391913" style="fill: #e16078; stroke: #000000"/>
    </g>
    <g clip-path="url(#pd13ad75489)">
     <use xlink:href="#C1_0_5889f4d75c" x="199.393996" y="128.542921" style="fill: #72b54b; stroke: #000000"/>
    </g>
    <g clip-path="url(#pd13ad75489)">
     <use xlink:href="#C1_0_5889f4d75c" x="292.754633" y="167.825465" style="fill: #f374ec; stroke: #000000"/>
    </g>
    <g clip-path="url(#pd13ad75489)">
     <use xlink:href="#C1_0_5889f4d75c" x="291.732018" y="128.542921" style="fill: #a7bf5d; stroke: #000000"/>
    </g>
    <g clip-path="url(#pd13ad75489)">
     <use xlink:href="#C1_0_5889f4d75c" x="269.133909" y="159.092794" style="fill: #b9a05b; stroke: #000000"/>
    </g>
    <g clip-path="url(#pd13ad75489)">
     <use xlink:href="#C1_0_5889f4d75c" x="257.774763" y="128.542921" style="fill: #55a1bd; stroke: #000000"/>
    </g>
    <g clip-path="url(#pd13ad75489)">
     <use xlink:href="#C1_0_5889f4d75c" x="368.386846" y="198.750652" style="fill: #8dea68; stroke: #000000"/>
    </g>
    <g clip-path="url(#pd13ad75489)">
     <use xlink:href="#C1_0_5889f4d75c" x="350.065625" y="280.468027" style="fill: #6b55b8; stroke: #000000"/>
    </g>
    <g clip-path="url(#pd13ad75489)">
     <use xlink:href="#C1_0_5889f4d75c" x="383.871463" y="195.595672" style="fill: #709acd; stroke: #000000"/>
    </g>
    <g clip-path="url(#pd13ad75489)">
     <use xlink:href="#C1_0_5889f4d75c" x="371.871571" y="210.068447" style="fill: #b9a24f; stroke: #000000"/>
    </g>
    <g clip-path="url(#pd13ad75489)">
     <use xlink:href="#C1_0_5889f4d75c" x="393.042127" y="202.267359" style="fill: #4a96b6; stroke: #000000"/>
    </g>
    <g clip-path="url(#pd13ad75489)">
     <use xlink:href="#C1_0_5889f4d75c" x="302.721574" y="128.542921" style="fill: #70f9bd; stroke: #000000"/>
    </g>
    <g clip-path="url(#pd13ad75489)">
     <use xlink:href="#C1_0_5889f4d75c" x="298.652675" y="166.241052" style="fill: #d472c0; stroke: #000000"/>
    </g>
    <g clip-path="url(#pd13ad75489)">
     <use xlink:href="#C1_0_5889f4d75c" x="321.897603" y="128.542921" style="fill: #a990f9; stroke: #000000"/>
    </g>
    <g clip-path="url(#pd13ad75489)">
     <use xlink:href="#C1_0_5889f4d75c" x="396.398264" y="128.542921" style="fill: #9b59d1; stroke: #000000"/>
    </g>
    <g clip-path="url(#pd13ad75489)">
     <use xlink:href="#C1_0_5889f4d75c" x="404.599198" y="285.562188" style="fill: #7f4db6; stroke: #000000"/>
    </g>
    <g clip-path="url(#pd13ad75489)">
     <use xlink:href="#C1_0_5889f4d75c" x="408.761036" y="273.264329" style="fill: #768af8; stroke: #000000"/>
    </g>
    <g clip-path="url(#pd13ad75489)">
     <use xlink:href="#C1_0_5889f4d75c" x="429.838266" y="254.319022" style="fill: #6dc8bd; stroke: #000000"/>
    </g>
    <g clip-path="url(#pd13ad75489)">
     <use xlink:href="#C1_0_5889f4d75c" x="429.838266" y="246.099814" style="fill: #c45450; stroke: #000000"/>
    </g>
    <g clip-path="url(#pd13ad75489)">
     <use xlink:href="#C1_0_5889f4d75c" x="429.838266" y="195.181155" style="fill: #add067; stroke: #000000"/>
    </g>
    <g clip-path="url(#pd13ad75489)">
     <use xlink:href="#C1_0_5889f4d75c" x="429.838266" y="255.054626" style="fill: #d5c06c; stroke: #000000"/>
    </g>
    <g clip-path="url(#pd13ad75489)">
     <use xlink:href="#C1_0_5889f4d75c" x="429.838266" y="144.559616" style="fill: #9ad46f; stroke: #000000"/>
    </g>
    <g clip-path="url(#pd13ad75489)">
     <use xlink:href="#C1_0_5889f4d75c" x="429.838266" y="180.394698" style="fill: #715ce6; stroke: #000000"/>
    </g>
    <g clip-path="url(#pd13ad75489)">
     <use xlink:href="#C1_0_5889f4d75c" x="429.838266" y="159.900083" style="fill: #65be6b; stroke: #000000"/>
    </g>
    <g clip-path="url(#pd13ad75489)">
     <use xlink:href="#C1_0_5889f4d75c" x="429.838266" y="144.295122" style="fill: #6271bd; stroke: #000000"/>
    </g>
    <g clip-path="url(#pd13ad75489)">
     <use xlink:href="#C1_0_5889f4d75c" x="429.838266" y="176.624853" style="fill: #df986e; stroke: #000000"/>
    </g>
    <g clip-path="url(#pd13ad75489)">
     <use xlink:href="#C1_0_5889f4d75c" x="429.838266" y="184.333518" style="fill: #c55754; stroke: #000000"/>
    </g>
    <g clip-path="url(#pd13ad75489)">
     <use xlink:href="#C1_0_5889f4d75c" x="429.838266" y="171.371109" style="fill: #fa7273; stroke: #000000"/>
    </g>
    <g clip-path="url(#pd13ad75489)">
     <use xlink:href="#C1_0_5889f4d75c" x="429.838266" y="128.542921" style="fill: #fad483; stroke: #000000"/>
    </g>
    <g clip-path="url(#pd13ad75489)">
     <use xlink:href="#C1_0_5889f4d75c" x="425.328376" y="128.542921" style="fill: #f39e91; stroke: #000000"/>
    </g>
    <g clip-path="url(#pd13ad75489)">
     <use xlink:href="#C1_0_5889f4d75c" x="429.838266" y="128.542921" style="fill: #7ded9d; stroke: #000000"/>
    </g>
    <g clip-path="url(#pd13ad75489)">
     <use xlink:href="#C1_0_5889f4d75c" x="429.838266" y="128.542921" style="fill: #f9c791; stroke: #000000"/>
    </g>
   </g>
  </g>
 </g>
 <defs>
  <clipPath id="pd13ad75489">
   <rect x="72" y="69.12" width="446.4" height="443.52"/>
  </clipPath>
 </defs>
</svg>
