{
    "bip": "10.247.0.1/25",
    "dns": ["10.10.10.10","10.10.10.11"],
    "default-address-pools":[
        {"base":"10.247.0.0/16","size":25}
    ],
    "registry-mirrors": ["https://docker-mirror.univ-lyon1.fr"]

}
