   6.11111103E-03           0
   1.22222221E-02           0
   1.83333345E-02           0
   2.44444441E-02           0
   3.05555556E-02           0
   3.66666690E-02           0
   4.27777804E-02           0
   4.88888882E-02           0
   5.50000034E-02           0
   6.11111112E-02           0
   6.72222227E-02           0
   7.33333379E-02           0
   7.94444457E-02           0
   8.55555609E-02           0
   9.16666687E-02           0
   9.77777764E-02           0
  0.103888892               0
  0.110000007               0
  0.116111107               0
  0.122222222               0
  0.128333330               0
  0.134444445               0
  0.140555561               0
  0.146666676               0
  0.152777776               0
  0.158888891               0
  0.165000007               0
  0.171111122               0
  0.177222237               0
  0.183333337               0
  0.189444453               0
  0.195555553               0
  0.201666668               0
  0.207777783               0
  0.213888884               0
  0.220000014               0
  0.226111114               0
  0.232222214               0
  0.238333344               0
  0.244444445               0
  0.250555575               0
  0.256666660               0
  0.262777776               0
  0.268888891               0
  0.275000006               0
  0.281111121               0
  0.287222236               0
  0.293333352               0
  0.299444467               0
  0.305555552               0
  0.311666667               0
  0.317777783               0
  0.323888898               0
  0.330000013               0
  0.336111099               0
  0.342222244               0
  0.348333329               0
  0.354444474               0
  0.360555559               0
  0.366666675               0
  0.372777760               0
  0.378888905               0
  0.385000020               0
  0.391111106               0
  0.397222221               0
  0.403333336               0
  0.409444481               0
  0.415555567               0
  0.421666682               0
  0.427777767               0
  0.433888882               0
  0.440000027               0
  0.446111143               0
  0.452222228               0
  0.458333343               0
  0.464444429               0
  0.470555574               0
  0.476666689               0
  0.482777774               0
  0.488888890               0
  0.495000005               0
  0.501111150               0
  0.507222235               0
  0.513333321               0
  0.519444466               0
  0.525555551               0
  0.531666696               0
  0.537777781               0
  0.543888927               0
  0.550000012               0
  0.556111097               0
  0.562222242               0
  0.568333328               0
  0.574444473               0
  0.580555558               0
  0.586666703               0
  0.592777789               0
  0.598888934               0
  0.605000019               0
  0.611111104               0
  0.617222250               0
  0.623333335               0
  0.629444480               0
  0.635555565               0
  0.641666651               0
  0.647777796               0
  0.653888941               0
  0.660000026               0
  0.666111112               0
  0.672222197               0
  0.678333342               0
  0.684444487               0
  0.690555573               0
  0.696666658               0
  0.702777803               0
  0.708888948               0
  0.714999974               0
  0.721111119               0
  0.727222264               0
  0.733333349               0
  0.739444494               0
  0.745555520               0
  0.751666665               0
  0.757777810               0
  0.763888896               0
  0.770000041               0
  0.776111066               0
  0.782222211               0
  0.788333356               0
  0.794444442               0
  0.800555587               0
  0.806666672               0
  0.812777817               0
  0.818888962               0
  0.824999988               0
  0.831111133               0
  0.837222219               0
  0.843333364               0
  0.849444509               0
  0.855555534               0
  0.861666679               0
  0.867777765               0
  0.873888910               0
  0.880000055               0
  0.886111140               0
  0.892222285               0
  0.898333311               0
  0.904444456               0
  0.910555601               0
  0.916666687               0
  0.922777832               0
  0.928888857               0
  0.935000002               0
  0.941111147               0
  0.947222233               0
  0.953333378               0
  0.959444404               0
  0.965555549               0
  0.971666694               0
  0.977777779               0
  0.983888924               0
  0.990000010               0
  0.996111155               0
   1.00222230               0
   1.00833333               0
   1.01444447               0
   1.02055550               0
   1.02666664               0
   1.03277779               0
   1.03888893               0
   1.04500008               0
   1.05111110               0
   1.05722225               0
   1.06333339               0
   1.06944442               0
   1.07555556               0
   1.08166671               0
   1.08777785               0
   1.09388900             169
   1.10000002         1919831
