values,models
0.000000000050,1551.000000000000
0.000000000100,4182.000000000000
0.000000000150,11514.000000000000
0.000000000200,10358.000000000000
0.000000000250,7635.000000000000
0.000000000300,7499.000000000000
0.000000000350,9309.000000000000
0.000000000400,13840.000000000000
0.000000000450,21332.000000000000
0.000000000501,29456.000000000000
0.000000000551,29247.000000000000
0.000000000601,28913.000000000000
0.000000000651,27458.000000000000
0.000000000701,24544.000000000000
0.000000000751,21100.000000000000
0.000000000801,18122.000000000000
0.000000000851,15051.000000000000
0.000000000901,13766.000000000000
0.000000000951,13301.000000000000
0.000000001001,13682.000000000000
0.000000001051,14187.000000000000
0.000000001101,17200.000000000000
0.000000001151,20284.000000000000
0.000000001201,23222.000000000000
0.000000001251,28856.000000000000
0.000000001301,34012.000000000000
0.000000001351,39149.000000000000
0.000000001401,46906.000000000000
0.000000001451,51115.000000000000
0.000000001502,52512.000000000000
0.000000001552,53350.000000000000
0.000000001602,52309.000000000000
0.000000001652,54111.000000000000
0.000000001702,50302.000000000000
0.000000001752,49363.000000000000
0.000000001802,46379.000000000000
0.000000001852,43574.000000000000
0.000000001902,40767.000000000000
0.000000001952,38730.000000000000
0.000000002002,37128.000000000000
0.000000002052,34073.000000000000
0.000000002102,33911.000000000000
0.000000002152,32982.000000000000
0.000000002202,32052.000000000000
0.000000002252,31481.000000000000
0.000000002302,30649.000000000000
0.000000002352,28749.000000000000
0.000000002402,27995.000000000000
0.000000002452,26945.000000000000
0.000000002503,26774.000000000000
0.000000002553,25107.000000000000
0.000000002603,25296.000000000000
0.000000002653,24388.000000000000
0.000000002703,22762.000000000000
0.000000002753,23006.000000000000
0.000000002803,22133.000000000000
0.000000002853,21422.000000000000
0.000000002903,19538.000000000000
0.000000002953,18447.000000000000
0.000000003003,18234.000000000000
0.000000003053,17466.000000000000
0.000000003103,16305.000000000000
0.000000003153,15396.000000000000
0.000000003203,14802.000000000000
0.000000003253,14674.000000000000
0.000000003303,13050.000000000000
0.000000003353,13092.000000000000
0.000000003403,12127.000000000000
0.000000003453,10755.000000000000
0.000000003504,9856.000000000000
0.000000003554,9228.000000000000
0.000000003604,8541.000000000000
0.000000003654,8527.000000000000
0.000000003704,8139.000000000000
0.000000003754,7748.000000000000
0.000000003804,8021.000000000000
0.000000003854,7097.000000000000
0.000000003904,7185.000000000000
0.000000003954,6093.000000000000
0.000000004004,6161.000000000000
0.000000004054,5173.000000000000
0.000000004104,4978.000000000000
0.000000004154,3922.000000000000
0.000000004204,3339.000000000000
0.000000004254,3380.000000000000
0.000000004304,3198.000000000000
0.000000004354,2732.000000000000
0.000000004404,2543.000000000000
0.000000004454,2623.000000000000
0.000000004505,2374.000000000000
0.000000004555,2049.000000000000
0.000000004605,2215.000000000000
0.000000004655,1860.000000000000
0.000000004705,1941.000000000000
0.000000004755,1329.000000000000
0.000000004805,1285.000000000000
0.000000004855,1043.000000000000
0.000000004905,1047.000000000000
0.000000004955,875.000000000000
0.000000005005,785.000000000000
0.000000005055,811.000000000000
0.000000005105,719.000000000000
0.000000005155,577.000000000000
0.000000005205,550.000000000000
0.000000005255,430.000000000000
0.000000005305,511.000000000000
0.000000005355,525.000000000000
0.000000005405,308.000000000000
0.000000005455,317.000000000000
0.000000005506,206.000000000000
0.000000005556,294.000000000000
0.000000005606,246.000000000000
0.000000005656,283.000000000000
0.000000005706,273.000000000000
0.000000005756,359.000000000000
0.000000005806,353.000000000000
0.000000005856,403.000000000000
0.000000005906,229.000000000000
0.000000005956,242.000000000000
0.000000006006,234.000000000000
0.000000006056,216.000000000000
0.000000006106,355.000000000000
0.000000006156,276.000000000000
0.000000006206,159.000000000000
0.000000006256,180.000000000000
0.000000006306,280.000000000000
0.000000006356,163.000000000000
0.000000006406,233.000000000000
0.000000006456,242.000000000000
0.000000006507,241.000000000000
0.000000006557,205.000000000000
0.000000006607,221.000000000000
0.000000006657,158.000000000000
0.000000006707,97.000000000000
0.000000006757,166.000000000000
0.000000006807,110.000000000000
0.000000006857,73.000000000000
0.000000006907,162.000000000000
0.000000006957,156.000000000000
0.000000007007,151.000000000000
0.000000007057,164.000000000000
0.000000007107,172.000000000000
0.000000007157,136.000000000000
0.000000007207,165.000000000000
0.000000007257,63.000000000000
0.000000007307,60.000000000000
0.000000007357,105.000000000000
0.000000007407,44.000000000000
0.000000007457,44.000000000000
0.000000007508,89.000000000000
0.000000007558,111.000000000000
0.000000007608,76.000000000000
0.000000007658,77.000000000000
0.000000007708,97.000000000000
0.000000007758,61.000000000000
0.000000007808,76.000000000000
0.000000007858,90.000000000000
0.000000007908,89.000000000000
0.000000007958,57.000000000000
0.000000008008,71.000000000000
0.000000008058,55.000000000000
0.000000008108,61.000000000000
0.000000008158,43.000000000000
0.000000008208,36.000000000000
0.000000008258,34.000000000000
0.000000008308,42.000000000000
0.000000008358,20.000000000000
0.000000008408,46.000000000000
0.000000008458,17.000000000000
0.000000008509,7.000000000000
0.000000008559,40.000000000000
0.000000008609,28.000000000000
0.000000008659,118.000000000000
0.000000008709,22.000000000000
0.000000008759,17.000000000000
0.000000008809,43.000000000000
0.000000008859,11.000000000000
0.000000008909,40.000000000000
0.000000008959,41.000000000000
0.000000009009,35.000000000000
0.000000009059,15.000000000000
0.000000009109,16.000000000000
0.000000009159,3.000000000000
0.000000009209,0.000000000000
0.000000009259,6.000000000000
0.000000009309,17.000000000000
0.000000009359,18.000000000000
0.000000009409,14.000000000000
0.000000009459,15.000000000000
0.000000009510,36.000000000000
0.000000009560,23.000000000000
0.000000009610,4.000000000000
0.000000009660,84.000000000000
0.000000009710,41.000000000000
0.000000009760,28.000000000000
0.000000009810,17.000000000000
0.000000009860,34.000000000000
0.000000009910,31.000000000000
0.000000009960,27.000000000000
0.000000010010,53.000000000000
0.000000010060,6.000000000000
0.000000010110,8.000000000000
0.000000010160,39.000000000000
0.000000010210,15.000000000000
0.000000010260,2.000000000000
0.000000010310,25.000000000000
0.000000010360,18.000000000000
0.000000010410,28.000000000000
0.000000010460,2.000000000000
0.000000010511,2.000000000000
0.000000010561,3.000000000000
0.000000010611,27.000000000000
0.000000010661,0.000000000000
0.000000010711,6.000000000000
0.000000010761,10.000000000000
0.000000010811,29.000000000000
0.000000010861,0.000000000000
0.000000010911,0.000000000000
0.000000010961,17.000000000000
0.000000011011,3.000000000000
0.000000011061,0.000000000000
0.000000011111,4.000000000000
0.000000011161,5.000000000000
0.000000011211,4.000000000000
0.000000011261,0.000000000000
0.000000011311,12.000000000000
0.000000011361,53.000000000000
0.000000011411,56.000000000000
0.000000011461,17.000000000000
0.000000011512,12.000000000000
0.000000011562,75.000000000000
0.000000011612,0.000000000000
0.000000011662,35.000000000000
0.000000011712,35.000000000000
0.000000011762,25.000000000000
0.000000011812,45.000000000000
0.000000011862,0.000000000000
0.000000011912,34.000000000000
0.000000011962,7.000000000000
0.000000012012,10.000000000000
0.000000012062,0.000000000000
0.000000012112,5.000000000000
0.000000012162,1.000000000000
0.000000012212,7.000000000000
0.000000012262,3.000000000000
0.000000012312,14.000000000000
0.000000012362,2.000000000000
0.000000012412,13.000000000000
0.000000012462,1.000000000000
0.000000012513,0.000000000000
0.000000012563,14.000000000000
0.000000012613,0.000000000000
0.000000012663,0.000000000000
0.000000012713,6.000000000000
0.000000012763,0.000000000000
0.000000012813,3.000000000000
0.000000012863,0.000000000000
0.000000012913,0.000000000000
0.000000012963,0.000000000000
0.000000013013,0.000000000000
0.000000013063,0.000000000000
0.000000013113,0.000000000000
0.000000013163,0.000000000000
0.000000013213,0.000000000000
0.000000013263,0.000000000000
0.000000013313,0.000000000000
0.000000013363,9.000000000000
0.000000013413,0.000000000000
0.000000013463,0.000000000000
0.000000013514,3.000000000000
0.000000013564,1.000000000000
0.000000013614,3.000000000000
0.000000013664,31.000000000000
0.000000013714,0.000000000000
0.000000013764,25.000000000000
0.000000013814,2.000000000000
0.000000013864,2.000000000000
0.000000013914,29.000000000000
0.000000013964,0.000000000000
0.000000014014,2.000000000000
0.000000014064,0.000000000000
0.000000014114,13.000000000000
0.000000014164,0.000000000000
0.000000014214,1.000000000000
0.000000014264,5.000000000000
0.000000014314,0.000000000000
0.000000014364,3.000000000000
0.000000014414,0.000000000000
0.000000014464,0.000000000000
0.000000014515,0.000000000000
0.000000014565,0.000000000000
0.000000014615,0.000000000000
0.000000014665,3.000000000000
0.000000014715,0.000000000000
0.000000014765,0.000000000000
0.000000014815,0.000000000000
0.000000014865,5.000000000000
0.000000014915,1.000000000000
0.000000014965,5.000000000000
0.000000015015,2.000000000000
0.000000015065,0.000000000000
0.000000015115,2.000000000000
0.000000015165,0.000000000000
0.000000015215,0.000000000000
0.000000015265,0.000000000000
0.000000015315,0.000000000000
0.000000015365,0.000000000000
0.000000015415,0.000000000000
0.000000015465,0.000000000000
0.000000015516,0.000000000000
0.000000015566,0.000000000000
0.000000015616,0.000000000000
0.000000015666,0.000000000000
0.000000015716,0.000000000000
0.000000015766,0.000000000000
0.000000015816,0.000000000000
0.000000015866,0.000000000000
0.000000015916,0.000000000000
0.000000015966,0.000000000000
0.000000016016,0.000000000000
0.000000016066,0.000000000000
0.000000016116,0.000000000000
0.000000016166,0.000000000000
0.000000016216,0.000000000000
0.000000016266,0.000000000000
0.000000016316,0.000000000000
0.000000016366,0.000000000000
0.000000016416,0.000000000000
0.000000016466,1.000000000000
0.000000016517,0.000000000000
0.000000016567,4.000000000000
0.000000016617,0.000000000000
0.000000016667,0.000000000000
0.000000016717,0.000000000000
0.000000016767,0.000000000000
0.000000016817,0.000000000000
0.000000016867,0.000000000000
0.000000016917,0.000000000000
0.000000016967,0.000000000000
0.000000017017,0.000000000000
0.000000017067,0.000000000000
0.000000017117,0.000000000000
0.000000017167,0.000000000000
0.000000017217,0.000000000000
0.000000017267,0.000000000000
0.000000017317,0.000000000000
0.000000017367,0.000000000000
0.000000017417,0.000000000000
0.000000017467,0.000000000000
0.000000017518,8.000000000000
0.000000017568,0.000000000000
0.000000017618,0.000000000000
0.000000017668,0.000000000000
0.000000017718,0.000000000000
0.000000017768,0.000000000000
0.000000017818,0.000000000000
0.000000017868,0.000000000000
0.000000017918,0.000000000000
0.000000017968,0.000000000000
0.000000018018,0.000000000000
0.000000018068,0.000000000000
0.000000018118,0.000000000000
0.000000018168,0.000000000000
0.000000018218,0.000000000000
0.000000018268,14.000000000000
0.000000018318,0.000000000000
0.000000018368,0.000000000000
0.000000018418,0.000000000000
0.000000018468,0.000000000000
0.000000018519,0.000000000000
0.000000018569,0.000000000000
0.000000018619,0.000000000000
0.000000018669,0.000000000000
0.000000018719,0.000000000000
0.000000018769,0.000000000000
0.000000018819,3.000000000000
0.000000018869,0.000000000000
0.000000018919,0.000000000000
0.000000018969,0.000000000000
0.000000019019,0.000000000000
0.000000019069,0.000000000000
0.000000019119,0.000000000000
0.000000019169,0.000000000000
0.000000019219,0.000000000000
0.000000019269,0.000000000000
0.000000019319,8.000000000000
0.000000019369,0.000000000000
0.000000019419,0.000000000000
0.000000019469,0.000000000000
0.000000019520,0.000000000000
0.000000019570,0.000000000000
0.000000019620,0.000000000000
0.000000019670,0.000000000000
0.000000019720,0.000000000000
0.000000019770,0.000000000000
0.000000019820,0.000000000000
0.000000019870,0.000000000000
0.000000019920,0.000000000000
0.000000019970,0.000000000000
0.000000020020,0.000000000000
0.000000020070,0.000000000000
0.000000020120,0.000000000000
0.000000020170,0.000000000000
0.000000020220,0.000000000000
0.000000020270,0.000000000000
0.000000020320,0.000000000000
0.000000020370,5.000000000000
0.000000020420,8.000000000000
0.000000020470,0.000000000000
0.000000020521,0.000000000000
0.000000020571,0.000000000000
0.000000020621,0.000000000000
0.000000020671,0.000000000000
0.000000020721,0.000000000000
0.000000020771,0.000000000000
0.000000020821,0.000000000000
0.000000020871,0.000000000000
0.000000020921,0.000000000000
0.000000020971,0.000000000000
0.000000021021,0.000000000000
0.000000021071,0.000000000000
0.000000021121,0.000000000000
0.000000021171,0.000000000000
0.000000021221,0.000000000000
0.000000021271,8.000000000000
0.000000021321,0.000000000000
0.000000021371,0.000000000000
0.000000021421,0.000000000000
0.000000021471,0.000000000000
0.000000021522,0.000000000000
0.000000021572,0.000000000000
0.000000021622,0.000000000000
0.000000021672,0.000000000000
0.000000021722,0.000000000000
0.000000021772,8.000000000000
0.000000021822,0.000000000000
0.000000021872,0.000000000000
0.000000021922,0.000000000000
0.000000021972,0.000000000000
0.000000022022,0.000000000000
0.000000022072,0.000000000000
0.000000022122,0.000000000000
0.000000022172,0.000000000000
0.000000022222,0.000000000000
0.000000022272,0.000000000000
0.000000022322,0.000000000000
0.000000022372,0.000000000000
0.000000022422,0.000000000000
0.000000022472,0.000000000000
0.000000022523,0.000000000000
0.000000022573,0.000000000000
0.000000022623,0.000000000000
0.000000022673,0.000000000000
0.000000022723,0.000000000000
0.000000022773,0.000000000000
0.000000022823,0.000000000000
0.000000022873,0.000000000000
0.000000022923,0.000000000000
0.000000022973,0.000000000000
0.000000023023,0.000000000000
0.000000023073,0.000000000000
0.000000023123,0.000000000000
0.000000023173,0.000000000000
0.000000023223,0.000000000000
0.000000023273,0.000000000000
0.000000023323,0.000000000000
0.000000023373,0.000000000000
0.000000023423,0.000000000000
0.000000023473,0.000000000000
0.000000023524,0.000000000000
0.000000023574,0.000000000000
0.000000023624,0.000000000000
0.000000023674,0.000000000000
0.000000023724,0.000000000000
0.000000023774,0.000000000000
0.000000023824,0.000000000000
0.000000023874,0.000000000000
0.000000023924,0.000000000000
0.000000023974,0.000000000000
0.000000024024,0.000000000000
0.000000024074,0.000000000000
0.000000024124,0.000000000000
0.000000024174,0.000000000000
0.000000024224,0.000000000000
0.000000024274,0.000000000000
0.000000024324,0.000000000000
0.000000024374,0.000000000000
0.000000024424,0.000000000000
0.000000024474,0.000000000000
0.000000024525,0.000000000000
0.000000024575,0.000000000000
0.000000024625,0.000000000000
0.000000024675,0.000000000000
0.000000024725,0.000000000000
0.000000024775,0.000000000000
0.000000024825,0.000000000000
0.000000024875,0.000000000000
0.000000024925,0.000000000000
0.000000024975,0.000000000000
0.000000025025,0.000000000000
0.000000025075,0.000000000000
0.000000025125,0.000000000000
0.000000025175,0.000000000000
0.000000025225,0.000000000000
0.000000025275,0.000000000000
0.000000025325,0.000000000000
0.000000025375,0.000000000000
0.000000025425,0.000000000000
0.000000025475,0.000000000000
0.000000025526,0.000000000000
0.000000025576,0.000000000000
0.000000025626,0.000000000000
0.000000025676,0.000000000000
0.000000025726,0.000000000000
0.000000025776,0.000000000000
0.000000025826,0.000000000000
0.000000025876,0.000000000000
0.000000025926,0.000000000000
0.000000025976,0.000000000000
0.000000026026,0.000000000000
0.000000026076,0.000000000000
0.000000026126,0.000000000000
0.000000026176,0.000000000000
0.000000026226,0.000000000000
0.000000026276,0.000000000000
0.000000026326,0.000000000000
0.000000026376,0.000000000000
0.000000026426,0.000000000000
0.000000026476,0.000000000000
0.000000026527,0.000000000000
0.000000026577,0.000000000000
0.000000026627,0.000000000000
0.000000026677,0.000000000000
0.000000026727,0.000000000000
0.000000026777,0.000000000000
0.000000026827,0.000000000000
0.000000026877,0.000000000000
0.000000026927,0.000000000000
0.000000026977,0.000000000000
0.000000027027,0.000000000000
0.000000027077,0.000000000000
0.000000027127,0.000000000000
0.000000027177,0.000000000000
0.000000027227,0.000000000000
0.000000027277,0.000000000000
0.000000027327,0.000000000000
0.000000027377,0.000000000000
0.000000027427,0.000000000000
0.000000027477,0.000000000000
0.000000027528,0.000000000000
0.000000027578,0.000000000000
0.000000027628,0.000000000000
0.000000027678,0.000000000000
0.000000027728,0.000000000000
0.000000027778,0.000000000000
0.000000027828,0.000000000000
0.000000027878,0.000000000000
0.000000027928,0.000000000000
0.000000027978,0.000000000000
0.000000028028,0.000000000000
0.000000028078,0.000000000000
0.000000028128,0.000000000000
0.000000028178,0.000000000000
0.000000028228,0.000000000000
0.000000028278,0.000000000000
0.000000028328,0.000000000000
0.000000028378,0.000000000000
0.000000028428,0.000000000000
0.000000028478,0.000000000000
0.000000028529,0.000000000000
0.000000028579,0.000000000000
0.000000028629,0.000000000000
0.000000028679,0.000000000000
0.000000028729,0.000000000000
0.000000028779,0.000000000000
0.000000028829,0.000000000000
0.000000028879,0.000000000000
0.000000028929,0.000000000000
0.000000028979,0.000000000000
0.000000029029,0.000000000000
0.000000029079,0.000000000000
0.000000029129,0.000000000000
0.000000029179,0.000000000000
0.000000029229,0.000000000000
0.000000029279,0.000000000000
0.000000029329,0.000000000000
0.000000029379,0.000000000000
0.000000029429,0.000000000000
0.000000029479,0.000000000000
0.000000029530,0.000000000000
0.000000029580,0.000000000000
0.000000029630,0.000000000000
0.000000029680,0.000000000000
0.000000029730,0.000000000000
0.000000029780,0.000000000000
0.000000029830,0.000000000000
0.000000029880,0.000000000000
0.000000029930,0.000000000000
0.000000029980,0.000000000000
0.000000030030,0.000000000000
0.000000030080,0.000000000000
0.000000030130,0.000000000000
0.000000030180,0.000000000000
0.000000030230,0.000000000000
0.000000030280,0.000000000000
0.000000030330,0.000000000000
0.000000030380,0.000000000000
0.000000030430,0.000000000000
0.000000030480,0.000000000000
0.000000030531,0.000000000000
0.000000030581,0.000000000000
0.000000030631,0.000000000000
0.000000030681,0.000000000000
0.000000030731,0.000000000000
0.000000030781,0.000000000000
0.000000030831,0.000000000000
0.000000030881,0.000000000000
0.000000030931,0.000000000000
0.000000030981,0.000000000000
0.000000031031,0.000000000000
0.000000031081,0.000000000000
0.000000031131,0.000000000000
0.000000031181,0.000000000000
0.000000031231,0.000000000000
0.000000031281,0.000000000000
0.000000031331,0.000000000000
0.000000031381,0.000000000000
0.000000031431,0.000000000000
0.000000031481,0.000000000000
0.000000031532,0.000000000000
0.000000031582,0.000000000000
0.000000031632,0.000000000000
0.000000031682,0.000000000000
0.000000031732,0.000000000000
0.000000031782,0.000000000000
0.000000031832,0.000000000000
0.000000031882,0.000000000000
0.000000031932,0.000000000000
0.000000031982,0.000000000000
0.000000032032,0.000000000000
0.000000032082,0.000000000000
0.000000032132,0.000000000000
0.000000032182,0.000000000000
0.000000032232,0.000000000000
0.000000032282,0.000000000000
0.000000032332,0.000000000000
0.000000032382,0.000000000000
0.000000032432,0.000000000000
0.000000032482,0.000000000000
0.000000032533,0.000000000000
0.000000032583,0.000000000000
0.000000032633,0.000000000000
0.000000032683,0.000000000000
0.000000032733,0.000000000000
0.000000032783,0.000000000000
0.000000032833,0.000000000000
0.000000032883,0.000000000000
0.000000032933,0.000000000000
0.000000032983,0.000000000000
0.000000033033,0.000000000000
0.000000033083,0.000000000000
0.000000033133,0.000000000000
0.000000033183,0.000000000000
0.000000033233,0.000000000000
0.000000033283,0.000000000000
0.000000033333,0.000000000000
0.000000033383,0.000000000000
0.000000033433,0.000000000000
0.000000033483,0.000000000000
0.000000033534,0.000000000000
0.000000033584,0.000000000000
0.000000033634,0.000000000000
0.000000033684,0.000000000000
0.000000033734,0.000000000000
0.000000033784,0.000000000000
0.000000033834,0.000000000000
0.000000033884,0.000000000000
0.000000033934,0.000000000000
0.000000033984,0.000000000000
0.000000034034,0.000000000000
0.000000034084,0.000000000000
0.000000034134,0.000000000000
0.000000034184,0.000000000000
0.000000034234,0.000000000000
0.000000034284,0.000000000000
0.000000034334,0.000000000000
0.000000034384,0.000000000000
0.000000034434,0.000000000000
0.000000034484,0.000000000000
0.000000034535,0.000000000000
0.000000034585,0.000000000000
0.000000034635,0.000000000000
0.000000034685,0.000000000000
0.000000034735,0.000000000000
0.000000034785,0.000000000000
0.000000034835,0.000000000000
0.000000034885,0.000000000000
0.000000034935,0.000000000000
0.000000034985,0.000000000000
0.000000035035,0.000000000000
0.000000035085,0.000000000000
0.000000035135,0.000000000000
0.000000035185,0.000000000000
0.000000035235,0.000000000000
0.000000035285,0.000000000000
0.000000035335,0.000000000000
0.000000035385,0.000000000000
0.000000035435,0.000000000000
0.000000035485,0.000000000000
0.000000035536,0.000000000000
0.000000035586,0.000000000000
0.000000035636,0.000000000000
0.000000035686,0.000000000000
0.000000035736,0.000000000000
0.000000035786,0.000000000000
0.000000035836,0.000000000000
0.000000035886,0.000000000000
0.000000035936,0.000000000000
0.000000035986,0.000000000000
0.000000036036,0.000000000000
0.000000036086,0.000000000000
0.000000036136,0.000000000000
0.000000036186,0.000000000000
0.000000036236,0.000000000000
0.000000036286,0.000000000000
0.000000036336,0.000000000000
0.000000036386,0.000000000000
0.000000036436,0.000000000000
0.000000036486,0.000000000000
0.000000036537,0.000000000000
0.000000036587,0.000000000000
0.000000036637,0.000000000000
0.000000036687,0.000000000000
0.000000036737,0.000000000000
0.000000036787,0.000000000000
0.000000036837,0.000000000000
0.000000036887,0.000000000000
0.000000036937,0.000000000000
0.000000036987,0.000000000000
0.000000037037,0.000000000000
0.000000037087,0.000000000000
0.000000037137,0.000000000000
0.000000037187,0.000000000000
0.000000037237,0.000000000000
0.000000037287,0.000000000000
0.000000037337,0.000000000000
0.000000037387,0.000000000000
0.000000037437,0.000000000000
0.000000037487,0.000000000000
0.000000037538,0.000000000000
0.000000037588,0.000000000000
0.000000037638,0.000000000000
0.000000037688,0.000000000000
0.000000037738,0.000000000000
0.000000037788,0.000000000000
0.000000037838,0.000000000000
0.000000037888,0.000000000000
0.000000037938,0.000000000000
0.000000037988,0.000000000000
0.000000038038,0.000000000000
0.000000038088,0.000000000000
0.000000038138,0.000000000000
0.000000038188,0.000000000000
0.000000038238,0.000000000000
0.000000038288,0.000000000000
0.000000038338,0.000000000000
0.000000038388,0.000000000000
0.000000038438,0.000000000000
0.000000038488,0.000000000000
0.000000038539,0.000000000000
0.000000038589,0.000000000000
0.000000038639,0.000000000000
0.000000038689,0.000000000000
0.000000038739,0.000000000000
0.000000038789,0.000000000000
0.000000038839,0.000000000000
0.000000038889,0.000000000000
0.000000038939,0.000000000000
0.000000038989,0.000000000000
0.000000039039,0.000000000000
0.000000039089,0.000000000000
0.000000039139,0.000000000000
0.000000039189,0.000000000000
0.000000039239,0.000000000000
0.000000039289,0.000000000000
0.000000039339,0.000000000000
0.000000039389,0.000000000000
0.000000039439,0.000000000000
0.000000039489,0.000000000000
0.000000039540,0.000000000000
0.000000039590,0.000000000000
0.000000039640,0.000000000000
0.000000039690,0.000000000000
0.000000039740,0.000000000000
0.000000039790,0.000000000000
0.000000039840,0.000000000000
0.000000039890,0.000000000000
0.000000039940,0.000000000000
0.000000039990,0.000000000000
0.000000040040,0.000000000000
0.000000040090,0.000000000000
0.000000040140,0.000000000000
0.000000040190,0.000000000000
0.000000040240,0.000000000000
0.000000040290,0.000000000000
0.000000040340,0.000000000000
0.000000040390,0.000000000000
0.000000040440,0.000000000000
0.000000040490,0.000000000000
0.000000040541,0.000000000000
0.000000040591,0.000000000000
0.000000040641,0.000000000000
0.000000040691,0.000000000000
0.000000040741,0.000000000000
0.000000040791,0.000000000000
0.000000040841,0.000000000000
0.000000040891,0.000000000000
0.000000040941,0.000000000000
0.000000040991,0.000000000000
0.000000041041,0.000000000000
0.000000041091,0.000000000000
0.000000041141,0.000000000000
0.000000041191,0.000000000000
0.000000041241,0.000000000000
0.000000041291,0.000000000000
0.000000041341,0.000000000000
0.000000041391,0.000000000000
0.000000041441,0.000000000000
0.000000041491,0.000000000000
0.000000041542,0.000000000000
0.000000041592,0.000000000000
0.000000041642,0.000000000000
0.000000041692,0.000000000000
0.000000041742,0.000000000000
0.000000041792,0.000000000000
0.000000041842,0.000000000000
0.000000041892,0.000000000000
0.000000041942,0.000000000000
0.000000041992,0.000000000000
0.000000042042,0.000000000000
0.000000042092,0.000000000000
0.000000042142,0.000000000000
0.000000042192,0.000000000000
0.000000042242,0.000000000000
0.000000042292,0.000000000000
0.000000042342,0.000000000000
0.000000042392,0.000000000000
0.000000042442,0.000000000000
0.000000042492,0.000000000000
0.000000042543,0.000000000000
0.000000042593,0.000000000000
0.000000042643,0.000000000000
0.000000042693,0.000000000000
0.000000042743,0.000000000000
0.000000042793,0.000000000000
0.000000042843,0.000000000000
0.000000042893,0.000000000000
0.000000042943,0.000000000000
0.000000042993,0.000000000000
0.000000043043,0.000000000000
0.000000043093,0.000000000000
0.000000043143,0.000000000000
0.000000043193,0.000000000000
0.000000043243,0.000000000000
0.000000043293,0.000000000000
0.000000043343,0.000000000000
0.000000043393,0.000000000000
0.000000043443,0.000000000000
0.000000043493,0.000000000000
0.000000043544,0.000000000000
0.000000043594,0.000000000000
0.000000043644,0.000000000000
0.000000043694,0.000000000000
0.000000043744,0.000000000000
0.000000043794,0.000000000000
0.000000043844,0.000000000000
0.000000043894,0.000000000000
0.000000043944,0.000000000000
0.000000043994,0.000000000000
0.000000044044,0.000000000000
0.000000044094,0.000000000000
0.000000044144,0.000000000000
0.000000044194,0.000000000000
0.000000044244,0.000000000000
0.000000044294,0.000000000000
0.000000044344,0.000000000000
0.000000044394,0.000000000000
0.000000044444,0.000000000000
0.000000044494,0.000000000000
0.000000044545,0.000000000000
0.000000044595,0.000000000000
0.000000044645,0.000000000000
0.000000044695,0.000000000000
0.000000044745,0.000000000000
0.000000044795,0.000000000000
0.000000044845,0.000000000000
0.000000044895,0.000000000000
0.000000044945,0.000000000000
0.000000044995,0.000000000000
0.000000045045,0.000000000000
0.000000045095,0.000000000000
0.000000045145,0.000000000000
0.000000045195,0.000000000000
0.000000045245,0.000000000000
0.000000045295,0.000000000000
0.000000045345,0.000000000000
0.000000045395,0.000000000000
0.000000045445,0.000000000000
0.000000045495,0.000000000000
0.000000045546,0.000000000000
0.000000045596,0.000000000000
0.000000045646,0.000000000000
0.000000045696,0.000000000000
0.000000045746,0.000000000000
0.000000045796,0.000000000000
0.000000045846,0.000000000000
0.000000045896,0.000000000000
0.000000045946,0.000000000000
0.000000045996,0.000000000000
0.000000046046,0.000000000000
0.000000046096,0.000000000000
0.000000046146,0.000000000000
0.000000046196,0.000000000000
0.000000046246,0.000000000000
0.000000046296,0.000000000000
0.000000046346,0.000000000000
0.000000046396,0.000000000000
0.000000046446,0.000000000000
0.000000046496,0.000000000000
0.000000046547,0.000000000000
0.000000046597,0.000000000000
0.000000046647,0.000000000000
0.000000046697,0.000000000000
0.000000046747,0.000000000000
0.000000046797,0.000000000000
0.000000046847,0.000000000000
0.000000046897,0.000000000000
0.000000046947,0.000000000000
0.000000046997,0.000000000000
0.000000047047,0.000000000000
0.000000047097,0.000000000000
0.000000047147,0.000000000000
0.000000047197,0.000000000000
0.000000047247,0.000000000000
0.000000047297,0.000000000000
0.000000047347,0.000000000000
0.000000047397,0.000000000000
0.000000047447,0.000000000000
0.000000047497,0.000000000000
0.000000047548,0.000000000000
0.000000047598,0.000000000000
0.000000047648,0.000000000000
0.000000047698,0.000000000000
0.000000047748,0.000000000000
0.000000047798,0.000000000000
0.000000047848,0.000000000000
0.000000047898,0.000000000000
0.000000047948,0.000000000000
0.000000047998,0.000000000000
0.000000048048,0.000000000000
0.000000048098,0.000000000000
0.000000048148,0.000000000000
0.000000048198,0.000000000000
0.000000048248,0.000000000000
0.000000048298,0.000000000000
0.000000048348,0.000000000000
0.000000048398,0.000000000000
0.000000048448,0.000000000000
0.000000048498,0.000000000000
0.000000048549,0.000000000000
0.000000048599,0.000000000000
0.000000048649,0.000000000000
0.000000048699,0.000000000000
0.000000048749,0.000000000000
0.000000048799,0.000000000000
0.000000048849,0.000000000000
0.000000048899,0.000000000000
0.000000048949,0.000000000000
0.000000048999,0.000000000000
0.000000049049,0.000000000000
0.000000049099,0.000000000000
0.000000049149,0.000000000000
0.000000049199,0.000000000000
0.000000049249,0.000000000000
0.000000049299,0.000000000000
0.000000049349,0.000000000000
0.000000049399,0.000000000000
0.000000049449,0.000000000000
0.000000049499,0.000000000000
0.000000049550,0.000000000000
0.000000049600,0.000000000000
0.000000049650,0.000000000000
0.000000049700,0.000000000000
0.000000049750,0.000000000000
0.000000049800,0.000000000000
0.000000049850,0.000000000000
0.000000049900,0.000000000000
0.000000049950,0.000000000000
