<?xml version="1.0" encoding="UTF-8" standalone="no"?>
<!-- Created with Inkscape (http://www.inkscape.org/) -->

<svg
   xmlns:dc="http://purl.org/dc/elements/1.1/"
   xmlns:cc="http://creativecommons.org/ns#"
   xmlns:rdf="http://www.w3.org/1999/02/22-rdf-syntax-ns#"
   xmlns:svg="http://www.w3.org/2000/svg"
   xmlns="http://www.w3.org/2000/svg"
   xmlns:sodipodi="http://sodipodi.sourceforge.net/DTD/sodipodi-0.dtd"
   xmlns:inkscape="http://www.inkscape.org/namespaces/inkscape"
   width="210mm"
   height="297mm"
   viewBox="0 0 210 297"
   version="1.1"
   id="svg8"
   inkscape:version="0.92.5 (2060ec1f9f, 2020-04-08)"
   sodipodi:docname="modele.svg"
   inkscape:export-filename="/home/cours/NEW_COURSE/source/TP1_balistique/images/modele.png"
   inkscape:export-xdpi="96"
   inkscape:export-ydpi="96">
  <defs
     id="defs2">
    <marker
       inkscape:isstock="true"
       style="overflow:visible;"
       id="marker908"
       refX="0.0"
       refY="0.0"
       orient="auto"
       inkscape:stockid="Arrow1Lend">
      <path
         transform="scale(0.8) rotate(180) translate(12.5,0)"
         style="fill-rule:evenodd;stroke:#0014fd;stroke-width:1pt;stroke-opacity:1;fill:#0014fd;fill-opacity:1"
         d="M 0.0,0.0 L 5.0,-5.0 L -12.5,0.0 L 5.0,5.0 L 0.0,0.0 z "
         id="path906" />
    </marker>
    <marker
       inkscape:isstock="true"
       style="overflow:visible;"
       id="marker1235"
       refX="0.0"
       refY="0.0"
       orient="auto"
       inkscape:stockid="Arrow1Lend">
      <path
         transform="scale(0.8) rotate(180) translate(12.5,0)"
         style="fill-rule:evenodd;stroke:#000000;stroke-width:1pt;stroke-opacity:1;fill:#000000;fill-opacity:1"
         d="M 0.0,0.0 L 5.0,-5.0 L -12.5,0.0 L 5.0,5.0 L 0.0,0.0 z "
         id="path1233" />
    </marker>
    <marker
       inkscape:stockid="Arrow1Lend"
       orient="auto"
       refY="0.0"
       refX="0.0"
       id="Arrow1Lend"
       style="overflow:visible;"
       inkscape:isstock="true"
       inkscape:collect="always">
      <path
         id="path820"
         d="M 0.0,0.0 L 5.0,-5.0 L -12.5,0.0 L 5.0,5.0 L 0.0,0.0 z "
         style="fill-rule:evenodd;stroke:#000000;stroke-width:1pt;stroke-opacity:1;fill:#000000;fill-opacity:1"
         transform="scale(0.8) rotate(180) translate(12.5,0)" />
    </marker>
    <marker
       inkscape:stockid="Arrow1Lstart"
       orient="auto"
       refY="0.0"
       refX="0.0"
       id="Arrow1Lstart"
       style="overflow:visible"
       inkscape:isstock="true">
      <path
         id="path817"
         d="M 0.0,0.0 L 5.0,-5.0 L -12.5,0.0 L 5.0,5.0 L 0.0,0.0 z "
         style="fill-rule:evenodd;stroke:#000000;stroke-width:1pt;stroke-opacity:1;fill:#000000;fill-opacity:1"
         transform="scale(0.8) translate(12.5,0)" />
    </marker>
  </defs>
  <sodipodi:namedview
     id="base"
     pagecolor="#ffffff"
     bordercolor="#666666"
     borderopacity="1.0"
     inkscape:pageopacity="0.0"
     inkscape:pageshadow="2"
     inkscape:zoom="1.5572619"
     inkscape:cx="246.90772"
     inkscape:cy="662.74444"
     inkscape:document-units="mm"
     inkscape:current-layer="layer1"
     showgrid="false"
     inkscape:window-width="1848"
     inkscape:window-height="1016"
     inkscape:window-x="1672"
     inkscape:window-y="27"
     inkscape:window-maximized="1" />
  <metadata
     id="metadata5">
    <rdf:RDF>
      <cc:Work
         rdf:about="">
        <dc:format>image/svg+xml</dc:format>
        <dc:type
           rdf:resource="http://purl.org/dc/dcmitype/StillImage" />
        <dc:title />
      </cc:Work>
    </rdf:RDF>
  </metadata>
  <g
     inkscape:label="Calque 1"
     inkscape:groupmode="layer"
     id="layer1">
    <path
       style="fill:none;fill-rule:evenodd;stroke:#000000;stroke-width:0.565;stroke-linecap:butt;stroke-linejoin:miter;stroke-miterlimit:4;stroke-dasharray:none;stroke-opacity:1;marker-start:url(#Arrow1Lstart);marker-end:url(#Arrow1Lend)"
       d="m 38.058251,123.86893 0.169904,29.90291 30.072814,0.1699"
       id="path815"
       inkscape:connector-curvature="0"
       sodipodi:nodetypes="ccc" />
    <path
       style="fill:none;fill-rule:evenodd;stroke:#000000;stroke-width:1.06500006;stroke-linecap:butt;stroke-linejoin:miter;stroke-miterlimit:4;stroke-dasharray:none;stroke-opacity:1"
       d="m 38.228156,153.77184 c 0,0 29.88992,-48.10846 65.242714,-47.74272 30.92149,-1.21901 77.81553,61.50486 77.81553,61.50486"
       id="path1191"
       inkscape:connector-curvature="0"
       sodipodi:nodetypes="ccc" />
    <path
       style="opacity:1;fill:#150eff;fill-opacity:1;fill-rule:nonzero;stroke:none;stroke-width:0.19742121;stroke-linecap:round;stroke-linejoin:round;stroke-miterlimit:4;stroke-dasharray:none;stroke-dashoffset:1.50236213;stroke-opacity:1;paint-order:normal"
       id="path1193"
       sodipodi:type="arc"
       sodipodi:cx="38.133888"
       sodipodi:cy="154.9579"
       sodipodi:rx="1.2742717"
       sodipodi:ry="1.1893203"
       sodipodi:start="4.7864345"
       sodipodi:end="4.715566"
       d="m 38.228156,153.77184 a 1.2742717,1.1893203 0 0 1 1.177983,1.25302 1.2742717,1.1893203 0 0 1 -1.32144,1.12147 1.2742717,1.1893203 0 0 1 -1.224804,-1.21328 1.2742717,1.1893203 0 0 1 1.278042,-1.16446"
       sodipodi:open="true" />
    <path
       style="opacity:1;fill:#f70c25;fill-opacity:1;fill-rule:nonzero;stroke:none;stroke-width:0.19742121;stroke-linecap:round;stroke-linejoin:round;stroke-miterlimit:4;stroke-dasharray:none;stroke-dashoffset:1.50236213;stroke-opacity:1;paint-order:normal"
       id="path1193-3"
       sodipodi:type="arc"
       sodipodi:cx="181.28235"
       sodipodi:cy="168.7233"
       sodipodi:rx="1.2742717"
       sodipodi:ry="1.1893203"
       sodipodi:start="4.7864345"
       sodipodi:end="4.715566"
       d="m 181.37662,167.53724 a 1.2742717,1.1893203 0 0 1 1.17798,1.25301 1.2742717,1.1893203 0 0 1 -1.32144,1.12148 1.2742717,1.1893203 0 0 1 -1.2248,-1.21328 1.2742717,1.1893203 0 0 1 1.27804,-1.16447"
       sodipodi:open="true" />
    <path
       style="opacity:1;fill:#0bd9f9;fill-opacity:1;fill-rule:nonzero;stroke:none;stroke-width:0.31333724;stroke-linecap:round;stroke-linejoin:round;stroke-miterlimit:4;stroke-dasharray:none;stroke-dashoffset:1.50236213;stroke-opacity:1;paint-order:normal"
       id="path1193-3-6"
       sodipodi:type="arc"
       sodipodi:cx="119.44175"
       sodipodi:cy="109.68203"
       sodipodi:rx="1.9538834"
       sodipodi:ry="1.9538834"
       sodipodi:start="4.7864345"
       sodipodi:end="4.715566"
       d="m 119.58629,107.7335 a 1.9538834,1.9538834 0 0 1 1.80624,2.05853 1.9538834,1.9538834 0 0 1 -2.0262,1.84243 1.9538834,1.9538834 0 0 1 -1.87804,-1.99325 1.9538834,1.9538834 0 0 1 1.95967,-1.91305"
       sodipodi:open="true" />
    <path
       style="fill:none;fill-rule:evenodd;stroke:#000000;stroke-width:0.465;stroke-linecap:butt;stroke-linejoin:miter;stroke-miterlimit:4;stroke-dasharray:none;stroke-opacity:1;marker-end:url(#marker1235)"
       d="m 119.44796,111.46603 0.33359,16.31067"
       id="path1225"
       inkscape:connector-curvature="0" />
    <path
       style="fill:none;fill-rule:evenodd;stroke:#000000;stroke-width:0.26458332;stroke-linecap:butt;stroke-linejoin:miter;stroke-miterlimit:4;stroke-dasharray:1.5874999, 0.26458332;stroke-dashoffset:2.64583325;stroke-opacity:1"
       d="m 38.058251,108.57767 81.389709,-0.84951 v 0 l -0.17612,44.68446"
       id="path2173"
       inkscape:connector-curvature="0"
       sodipodi:nodetypes="cccc" />
    <text
       xml:space="preserve"
       style="font-style:normal;font-variant:normal;font-weight:bold;font-stretch:normal;font-size:4.93888855px;line-height:125%;font-family:'Arial Black';-inkscape-font-specification:'Arial Black, Bold';text-align:center;letter-spacing:0px;word-spacing:0px;writing-mode:lr-tb;text-anchor:middle;fill:#03d6eb;fill-opacity:1;stroke:none;stroke-width:0.26458332px;stroke-linecap:butt;stroke-linejoin:miter;stroke-opacity:1"
       x="120.12135"
       y="158.35922"
       id="text2177"><tspan
         sodipodi:role="line"
         id="tspan2175"
         x="120.12135"
         y="158.35922"
         style="fill:#03d6eb;fill-opacity:1;stroke-width:0.26458332px">x(t)</tspan></text>
    <text
       xml:space="preserve"
       style="font-style:normal;font-variant:normal;font-weight:bold;font-stretch:normal;font-size:4.93888855px;line-height:125%;font-family:'Arial Black';-inkscape-font-specification:'Arial Black, Bold';text-align:center;letter-spacing:0px;word-spacing:0px;writing-mode:lr-tb;text-anchor:middle;fill:#01d0f0;fill-opacity:1;stroke:none;stroke-width:0.26458332px;stroke-linecap:butt;stroke-linejoin:miter;stroke-opacity:1"
       x="30.412621"
       y="109.76699"
       id="text2181"><tspan
         sodipodi:role="line"
         id="tspan2179"
         x="30.412621"
         y="109.76699"
         style="fill:#01d0f0;fill-opacity:1;stroke-width:0.26458332px">y(t)</tspan></text>
    <text
       xml:space="preserve"
       style="font-style:normal;font-variant:normal;font-weight:bold;font-stretch:normal;font-size:5.64444447px;line-height:125%;font-family:'Arial Black';-inkscape-font-specification:'Arial Black, Bold';text-align:center;letter-spacing:0px;word-spacing:0px;writing-mode:lr-tb;text-anchor:middle;fill:#000000;fill-opacity:1;stroke:none;stroke-width:0.26458332px;stroke-linecap:butt;stroke-linejoin:miter;stroke-opacity:1"
       x="30.922331"
       y="156.66019"
       id="text2185"><tspan
         sodipodi:role="line"
         id="tspan2183"
         x="30.922331"
         y="161.72087"
         style="stroke-width:0.26458332px" /></text>
    <text
       xml:space="preserve"
       style="font-style:normal;font-variant:normal;font-weight:bold;font-stretch:normal;font-size:6.3499999px;line-height:125%;font-family:'Arial Black';-inkscape-font-specification:'Arial Black, Bold';text-align:center;letter-spacing:0px;word-spacing:0px;writing-mode:lr-tb;text-anchor:middle;fill:#0a1ff5;fill-opacity:1;stroke:none;stroke-width:0.26458332px;stroke-linecap:butt;stroke-linejoin:miter;stroke-opacity:1"
       x="31.60194"
       y="156.49028"
       id="text2189"><tspan
         sodipodi:role="line"
         id="tspan2187"
         x="31.60194"
         y="156.49028"
         style="fill:#0a1ff5;fill-opacity:1;stroke-width:0.26458332px">A</tspan></text>
    <text
       xml:space="preserve"
       style="font-style:normal;font-variant:normal;font-weight:bold;font-stretch:normal;font-size:6.3499999px;line-height:125%;font-family:'Arial Black';-inkscape-font-specification:'Arial Black, Bold';text-align:center;letter-spacing:0px;word-spacing:0px;writing-mode:lr-tb;text-anchor:middle;fill:#ff031e;fill-opacity:1;stroke:none;stroke-width:0.26458332px;stroke-linecap:butt;stroke-linejoin:miter;stroke-opacity:1"
       x="186.21359"
       y="169.40291"
       id="text2193"><tspan
         sodipodi:role="line"
         id="tspan2191"
         x="186.21359"
         y="169.40291"
         style="fill:#ff031e;fill-opacity:1;stroke-width:0.26458332px">B</tspan></text>
    <path
       style="fill:none;fill-rule:evenodd;stroke:#000000;stroke-width:0.26458332;stroke-linecap:butt;stroke-linejoin:miter;stroke-miterlimit:4;stroke-dasharray:0.79374995, 0.26458332;stroke-dashoffset:0;stroke-opacity:1"
       d="m 38.228143,166.68448 143.058257,0.8495"
       id="path2195"
       inkscape:connector-curvature="0"
       sodipodi:nodetypes="cc" />
    <path
       style="fill:none;fill-rule:evenodd;stroke:#000000;stroke-width:0.26458332;stroke-linecap:butt;stroke-linejoin:miter;stroke-miterlimit:4;stroke-dasharray:0.79374995, 0.26458332;stroke-dashoffset:0;stroke-opacity:1"
       d="m 181.2864,154.62136 -10e-6,12.91262"
       id="path2197"
       inkscape:connector-curvature="0"
       sodipodi:nodetypes="cc" />
    <text
       xml:space="preserve"
       style="font-style:normal;font-variant:normal;font-weight:bold;font-stretch:normal;font-size:6.3499999px;line-height:125%;font-family:'Arial Black';-inkscape-font-specification:'Arial Black, Bold';text-align:center;letter-spacing:0px;word-spacing:0px;writing-mode:lr-tb;text-anchor:middle;fill:#06e8ef;fill-opacity:1;stroke:none;stroke-width:0.26458332px;stroke-linecap:butt;stroke-linejoin:miter;stroke-opacity:1"
       x="123.68932"
       y="107.04855"
       id="text2201"><tspan
         sodipodi:role="line"
         id="tspan2199"
         x="123.68932"
         y="107.04855"
         style="fill:#06e8ef;fill-opacity:1;stroke-width:0.26458332px">P</tspan></text>
    <text
       xml:space="preserve"
       style="font-style:normal;font-variant:normal;font-weight:bold;font-stretch:normal;font-size:4.58611107px;line-height:125%;font-family:'Arial Black';-inkscape-font-specification:'Arial Black, Bold';text-align:center;letter-spacing:0px;word-spacing:0px;writing-mode:lr-tb;text-anchor:middle;fill:#ff152e;fill-opacity:1;stroke:none;stroke-width:0.26458332px;stroke-linecap:butt;stroke-linejoin:miter;stroke-opacity:1"
       x="180.6068"
       y="152.07281"
       id="text2205"><tspan
         sodipodi:role="line"
         id="tspan2203"
         x="180.6068"
         y="152.07281"
         style="fill:#ff152e;fill-opacity:1;stroke-width:0.26458332px">x<tspan
   style="font-size:64.99999762%;baseline-shift:sub;fill:#ff152e;fill-opacity:1"
   id="tspan2207">b</tspan></tspan></text>
    <text
       xml:space="preserve"
       style="font-style:normal;font-variant:normal;font-weight:bold;font-stretch:normal;font-size:4.58611107px;line-height:125%;font-family:'Arial Black';-inkscape-font-specification:'Arial Black, Bold';text-align:center;letter-spacing:0px;word-spacing:0px;writing-mode:lr-tb;text-anchor:middle;fill:#ff0a25;fill-opacity:1;stroke:none;stroke-width:0.26458332px;stroke-linecap:butt;stroke-linejoin:miter;stroke-opacity:1"
       x="31.432039"
       y="168.38348"
       id="text2211"><tspan
         sodipodi:role="line"
         id="tspan2209"
         x="31.432039"
         y="168.38348"
         style="fill:#ff0a25;fill-opacity:1;stroke-width:0.26458332px">y<tspan
   style="font-size:64.99999762%;baseline-shift:sub;fill:#ff0a25;fill-opacity:1"
   id="tspan2213">b</tspan></tspan></text>
    <path
       style="fill:none;fill-rule:evenodd;stroke:#000000;stroke-width:0.26458332;stroke-linecap:butt;stroke-linejoin:miter;stroke-miterlimit:4;stroke-dasharray:0.26458332, 0.79374995;stroke-dashoffset:0;stroke-opacity:1"
       d="m 68.300967,153.94174 126.577673,0.16991"
       id="path2215"
       inkscape:connector-curvature="0"
       sodipodi:nodetypes="cc" />
    <path
       style="fill:none;fill-rule:evenodd;stroke:#000000;stroke-width:0.24171084;stroke-linecap:butt;stroke-linejoin:miter;stroke-miterlimit:4;stroke-dasharray:0.24171084, 0.72513252;stroke-dashoffset:0;stroke-opacity:1"
       d="M 38.228153,82.583389 38.56796,176.87864"
       id="path2217"
       inkscape:connector-curvature="0"
       sodipodi:nodetypes="cc" />
    <text
       xml:space="preserve"
       style="font-style:normal;font-variant:normal;font-weight:bold;font-stretch:normal;font-size:4.58611107px;line-height:125%;font-family:'Arial Black';-inkscape-font-specification:'Arial Black, Bold';text-align:center;letter-spacing:0px;word-spacing:0px;writing-mode:lr-tb;text-anchor:middle;fill:#000000;fill-opacity:1;stroke:none;stroke-width:0.26458332px;stroke-linecap:butt;stroke-linejoin:miter;stroke-opacity:1"
       x="66.262138"
       y="149.86407"
       id="text2221"><tspan
         sodipodi:role="line"
         id="tspan2219"
         x="66.262138"
         y="149.86407"
         style="stroke-width:0.26458332px">x</tspan></text>
    <text
       xml:space="preserve"
       style="font-style:normal;font-variant:normal;font-weight:bold;font-stretch:normal;font-size:4.58611107px;line-height:125%;font-family:'Arial Black';-inkscape-font-specification:'Arial Black, Bold';text-align:center;letter-spacing:0px;word-spacing:0px;writing-mode:lr-tb;text-anchor:middle;fill:#000000;fill-opacity:1;stroke:none;stroke-width:0.26458332px;stroke-linecap:butt;stroke-linejoin:miter;stroke-opacity:1"
       x="42.135921"
       y="125.90777"
       id="text2225"><tspan
         sodipodi:role="line"
         id="tspan2223"
         x="42.135921"
         y="125.90777"
         style="stroke-width:0.26458332px">y</tspan></text>
    <g
       id="g2291"
       transform="matrix(0.43264384,0,0,0.49792286,13.095349,97.97041)">
      <g
         word-spacing="normal"
         letter-spacing="normal"
         font-size-adjust="none"
         font-stretch="normal"
         font-weight="normal"
         font-variant="normal"
         font-style="normal"
         stroke-miterlimit="10.433"
         xml:space="preserve"
         transform="matrix(0.3,0,0,-0.3,-52.5,222.75)"
         id="content"
         style="font-style:normal;font-variant:normal;font-weight:normal;font-stretch:normal;letter-spacing:normal;word-spacing:normal;text-anchor:start;fill:none;fill-opacity:1;fill-rule:evenodd;stroke:#000000;stroke-linecap:butt;stroke-linejoin:miter;stroke-miterlimit:10.43299961;stroke-dasharray:none;stroke-dashoffset:0;stroke-opacity:1"><path
           id="path2288"
           d="m 479.29,417.96 -0.01,0.37 -0.01,0.35 -0.02,0.35 -0.02,0.34 -0.06,0.65 -0.09,0.63 -0.11,0.59 -0.14,0.57 -0.15,0.54 -0.18,0.51 -0.19,0.49 -0.21,0.45 -0.23,0.44 -0.25,0.4 -0.26,0.38 -0.27,0.36 -0.29,0.33 -0.3,0.31 -0.31,0.29 -0.31,0.26 -0.33,0.24 -0.34,0.22 -0.34,0.2 -0.35,0.18 -0.35,0.16 -0.36,0.14 -0.35,0.12 -0.36,0.11 -0.37,0.09 -0.36,0.06 -0.36,0.06 -0.35,0.04 -0.35,0.02 h -0.35 l -0.05,-1.09 c 4.94,0 4.94,-6.53 4.94,-10.41 0,-1.84 0,-4.73 0.09,-5.57 v 0 c -4.37,-3.85 -8.22,-4.39 -10.2,-4.39 -3,0 -4.49,2.25 -4.49,5.43 0,2.44 1.3,7.82 2.89,10.36 2.33,3.64 5.04,4.58 6.77,4.58 l 0.05,1.09 c -6.82,0 -13.39,-7.12 -13.39,-14.14 0,-4.64 2.98,-8.42 8.06,-8.42 3.14,0 6.73,1.14 10.51,4.19 0.66,-2.64 2.3,-4.19 4.54,-4.19 2.64,0 4.18,2.74 4.18,3.53 0,0.36 -0.29,0.5 -0.59,0.5 -0.36,0 -0.5,-0.14 -0.66,-0.5 -0.89,-2.43 -2.68,-2.43 -2.78,-2.43 -1.54,0 -1.54,3.89 -1.54,5.07 0,1.05 0,1.16 0.5,1.75 4.68,5.88 5.73,11.66 5.73,11.71 0,0.11 -0.06,0.5 -0.61,0.5 -0.5,0 -0.5,-0.14 -0.75,-1.05 -0.89,-3.14 -2.53,-6.92 -4.87,-9.86 z"
           inkscape:connector-curvature="0"
           style="fill:#000000;stroke-width:0" /></g>    </g>
    <path
       style="opacity:1;fill:none;fill-opacity:1;fill-rule:nonzero;stroke:#000000;stroke-width:1.07689476;stroke-linecap:round;stroke-linejoin:round;stroke-miterlimit:4;stroke-dasharray:none;stroke-dashoffset:0;stroke-opacity:1;paint-order:normal"
       id="path2298"
       sodipodi:type="arc"
       sodipodi:cx="38.39859"
       sodipodi:cy="153.60139"
       sodipodi:rx="10.95767"
       sodipodi:ry="12.208162"
       sodipodi:start="5.3853121"
       sodipodi:end="6.2822831"
       d="m 45.228227,144.05457 a 10.95767,12.208162 0 0 1 4.128029,9.53581 l -10.957666,0.011 z" />
    <text
       xml:space="preserve"
       style="font-style:normal;font-variant:normal;font-weight:bold;font-stretch:normal;font-size:6.77120972px;line-height:125%;font-family:'Arial Black';-inkscape-font-specification:'Arial Black, Bold';text-align:center;letter-spacing:0px;word-spacing:0px;writing-mode:lr-tb;text-anchor:middle;fill:#000000;fill-opacity:1;stroke:none;stroke-width:0.3906467px;stroke-linecap:butt;stroke-linejoin:miter;stroke-opacity:1"
       x="107.54784"
       y="122.56144"
       id="text896"
       transform="scale(1.0181532,0.98217043)"><tspan
         sodipodi:role="line"
         id="tspan894"
         x="107.54784"
         y="122.56144"
         style="stroke-width:0.3906467px">mg</tspan></text>
    <path
       style="fill:none;fill-rule:evenodd;stroke:#0014fd;stroke-width:0.565;stroke-linecap:butt;stroke-linejoin:miter;stroke-miterlimit:4;stroke-dasharray:none;stroke-opacity:1;marker-end:url(#marker908)"
       d="M 38.39859,153.60139 56.067962,126.92718"
       id="path898"
       inkscape:connector-curvature="0" />
    <text
       xml:space="preserve"
       style="font-style:normal;font-variant:normal;font-weight:bold;font-stretch:normal;font-size:5.64444447px;line-height:125%;font-family:'Arial Black';-inkscape-font-specification:'Arial Black, Bold';text-align:center;letter-spacing:0px;word-spacing:0px;writing-mode:lr-tb;text-anchor:middle;fill:#000000;fill-opacity:1;stroke:none;stroke-width:0.26458332px;stroke-linecap:butt;stroke-linejoin:miter;stroke-opacity:1"
       x="51.31068"
       y="124.88834"
       id="text972"><tspan
         sodipodi:role="line"
         id="tspan970"
         x="51.31068"
         y="124.88834"
         style="stroke-width:0.26458332px;fill:#4000f5;fill-opacity:1">V<tspan
   style="font-size:65%;baseline-shift:sub;fill:#4000f5;fill-opacity:1"
   id="tspan974">0</tspan></tspan></text>
  </g>
</svg>
