%!PS-Adobe-2.0 EPSF-2.0
%%Title: /home/buffat/COURS/AERO/BILAN/fig.fig
%%Creator: fig2dev Version 3.2 Patchlevel 4
%%CreationDate: Thu Jun  9 17:56:52 2005
%%For: buffat@p2chpd-visu2.univ-lyon1.fr (Buffat Marc)
%%BoundingBox: 0 0 509 242
%%Magnification: 1.0000
%%EndComments
/$F2psDict 200 dict def
$F2psDict begin
$F2psDict /mtrx matrix put
/col-1 {0 setgray} bind def
/col0 {0.000 0.000 0.000 srgb} bind def
/col1 {0.000 0.000 1.000 srgb} bind def
/col2 {0.000 1.000 0.000 srgb} bind def
/col3 {0.000 1.000 1.000 srgb} bind def
/col4 {1.000 0.000 0.000 srgb} bind def
/col5 {1.000 0.000 1.000 srgb} bind def
/col6 {1.000 1.000 0.000 srgb} bind def
/col7 {1.000 1.000 1.000 srgb} bind def
/col8 {0.000 0.000 0.560 srgb} bind def
/col9 {0.000 0.000 0.690 srgb} bind def
/col10 {0.000 0.000 0.820 srgb} bind def
/col11 {0.530 0.810 1.000 srgb} bind def
/col12 {0.000 0.560 0.000 srgb} bind def
/col13 {0.000 0.690 0.000 srgb} bind def
/col14 {0.000 0.820 0.000 srgb} bind def
/col15 {0.000 0.560 0.560 srgb} bind def
/col16 {0.000 0.690 0.690 srgb} bind def
/col17 {0.000 0.820 0.820 srgb} bind def
/col18 {0.560 0.000 0.000 srgb} bind def
/col19 {0.690 0.000 0.000 srgb} bind def
/col20 {0.820 0.000 0.000 srgb} bind def
/col21 {0.560 0.000 0.560 srgb} bind def
/col22 {0.690 0.000 0.690 srgb} bind def
/col23 {0.820 0.000 0.820 srgb} bind def
/col24 {0.500 0.190 0.000 srgb} bind def
/col25 {0.630 0.250 0.000 srgb} bind def
/col26 {0.750 0.380 0.000 srgb} bind def
/col27 {1.000 0.500 0.500 srgb} bind def
/col28 {1.000 0.630 0.630 srgb} bind def
/col29 {1.000 0.750 0.750 srgb} bind def
/col30 {1.000 0.880 0.880 srgb} bind def
/col31 {1.000 0.840 0.000 srgb} bind def
/col32 {0.949 0.031 0.984 srgb} bind def
/col33 {0.809 0.172 0.984 srgb} bind def
/col34 {0.652 0.328 0.984 srgb} bind def
/col35 {0.473 0.508 0.984 srgb} bind def
/col36 {0.219 0.762 0.984 srgb} bind def

end
save
newpath 0 242 moveto 0 0 lineto 509 0 lineto 509 242 lineto closepath clip newpath
-35.8 504.0 translate
1 -1 scale

/cp {closepath} bind def
/ef {eofill} bind def
/gr {grestore} bind def
/gs {gsave} bind def
/sa {save} bind def
/rs {restore} bind def
/l {lineto} bind def
/m {moveto} bind def
/rm {rmoveto} bind def
/n {newpath} bind def
/s {stroke} bind def
/sh {show} bind def
/slc {setlinecap} bind def
/slj {setlinejoin} bind def
/slw {setlinewidth} bind def
/srgb {setrgbcolor} bind def
/rot {rotate} bind def
/sc {scale} bind def
/sd {setdash} bind def
/ff {findfont} bind def
/sf {setfont} bind def
/scf {scalefont} bind def
/sw {stringwidth} bind def
/tr {translate} bind def
/tnt {dup dup currentrgbcolor
  4 -2 roll dup 1 exch sub 3 -1 roll mul add
  4 -2 roll dup 1 exch sub 3 -1 roll mul add
  4 -2 roll dup 1 exch sub 3 -1 roll mul add srgb}
  bind def
/shd {dup dup currentrgbcolor 4 -2 roll mul 4 -2 roll mul
  4 -2 roll mul srgb} bind def
/reencdict 12 dict def /ReEncode { reencdict begin
/newcodesandnames exch def /newfontname exch def /basefontname exch def
/basefontdict basefontname findfont def /newfont basefontdict maxlength dict def
basefontdict { exch dup /FID ne { dup /Encoding eq
{ exch dup length array copy newfont 3 1 roll put }
{ exch newfont 3 1 roll put } ifelse } { pop pop } ifelse } forall
newfont /FontName newfontname put newcodesandnames aload pop
128 1 255 { newfont /Encoding get exch /.notdef put } for
newcodesandnames length 2 idiv { newfont /Encoding get 3 1 roll put } repeat
newfontname newfont definefont pop end } def
/isovec [
8#055 /minus 8#200 /grave 8#201 /acute 8#202 /circumflex 8#203 /tilde
8#204 /macron 8#205 /breve 8#206 /dotaccent 8#207 /dieresis
8#210 /ring 8#211 /cedilla 8#212 /hungarumlaut 8#213 /ogonek 8#214 /caron
8#220 /dotlessi 8#230 /oe 8#231 /OE
8#240 /space 8#241 /exclamdown 8#242 /cent 8#243 /sterling
8#244 /currency 8#245 /yen 8#246 /brokenbar 8#247 /section 8#250 /dieresis
8#251 /copyright 8#252 /ordfeminine 8#253 /guillemotleft 8#254 /logicalnot
8#255 /hyphen 8#256 /registered 8#257 /macron 8#260 /degree 8#261 /plusminus
8#262 /twosuperior 8#263 /threesuperior 8#264 /acute 8#265 /mu 8#266 /paragraph
8#267 /periodcentered 8#270 /cedilla 8#271 /onesuperior 8#272 /ordmasculine
8#273 /guillemotright 8#274 /onequarter 8#275 /onehalf
8#276 /threequarters 8#277 /questiondown 8#300 /Agrave 8#301 /Aacute
8#302 /Acircumflex 8#303 /Atilde 8#304 /Adieresis 8#305 /Aring
8#306 /AE 8#307 /Ccedilla 8#310 /Egrave 8#311 /Eacute
8#312 /Ecircumflex 8#313 /Edieresis 8#314 /Igrave 8#315 /Iacute
8#316 /Icircumflex 8#317 /Idieresis 8#320 /Eth 8#321 /Ntilde 8#322 /Ograve
8#323 /Oacute 8#324 /Ocircumflex 8#325 /Otilde 8#326 /Odieresis 8#327 /multiply
8#330 /Oslash 8#331 /Ugrave 8#332 /Uacute 8#333 /Ucircumflex
8#334 /Udieresis 8#335 /Yacute 8#336 /Thorn 8#337 /germandbls 8#340 /agrave
8#341 /aacute 8#342 /acircumflex 8#343 /atilde 8#344 /adieresis 8#345 /aring
8#346 /ae 8#347 /ccedilla 8#350 /egrave 8#351 /eacute
8#352 /ecircumflex 8#353 /edieresis 8#354 /igrave 8#355 /iacute
8#356 /icircumflex 8#357 /idieresis 8#360 /eth 8#361 /ntilde 8#362 /ograve
8#363 /oacute 8#364 /ocircumflex 8#365 /otilde 8#366 /odieresis 8#367 /divide
8#370 /oslash 8#371 /ugrave 8#372 /uacute 8#373 /ucircumflex
8#374 /udieresis 8#375 /yacute 8#376 /thorn 8#377 /ydieresis] def
/Helvetica /Helvetica-iso isovec ReEncode
/Helvetica-Bold /Helvetica-Bold-iso isovec ReEncode
/Bookman-Demi /Bookman-Demi-iso isovec ReEncode
/$F2psBegin {$F2psDict begin /$F2psEnteredState save def} def
/$F2psEnd {$F2psEnteredState restore end} def

$F2psBegin
10 setmiterlimit
0 slj 0 slc
 0.06000 0.06000 sc
%
% Fig objects follow
%
% 
% here starts figure with depth 948
%  polyline 
% Polyline
7.500 slw
n 1548 6845 m
 1622 6845 l gs col0 s gr 
% here ends figure;
% 
% here starts figure with depth 946
%  text 
/Helvetica-iso ff 165.00 scf sf
986 6906 m
gs 1 -1 sc (-0.005) col0 sh gr
%  polyline 
% Polyline
7.500 slw
n 1548 6475 m
 1622 6475 l gs col0 s gr 
% here ends figure;
% 
% here starts figure with depth 943
%  text 
/Helvetica-iso ff 165.00 scf sf
1408 6536 m
gs 1 -1 sc (0) col0 sh gr
%  polyline 
% Polyline
7.500 slw
n 1548 6102 m
 1622 6102 l gs col0 s gr 
% here ends figure;
% 
% here starts figure with depth 940
%  text 
/Helvetica-iso ff 165.00 scf sf
1083 6163 m
gs 1 -1 sc (0.005) col0 sh gr
% here ends figure;
% 
% here starts figure with depth 926
%  polyline 
% Polyline
15.000 slw
n 3927 7813 m 6606 7813 l 6606 5134 l 3927 5134 l
 3927 7813 l  cp gs col0 s gr 
% here ends figure;
% 
% here starts figure with depth 924
%  polyline 
% Polyline
n 8358 7069 m 9065 7069 l 9065 5879 l 8358 5879 l
 8358 7069 l  cp gs col32 1.00 shd ef gr 
% here ends figure;
% 
% here starts figure with depth 922
%  polyline 
% Polyline
7.500 slw
n 8358 7069 m 9065 7069 l 9065 5879 l 8358 5879 l
 8358 7069 l  cp gs col0 s gr 
%  polyline 
% Polyline
0.000 slw
n 7319 7069 m 8087 7069 l 8087 5879 l 7319 5879 l
 7319 7069 l  cp gs col33 1.00 shd ef gr 
% here ends figure;
% 
% here starts figure with depth 919
%  polyline 
% Polyline
7.500 slw
n 7319 7069 m 8087 7069 l 8087 5879 l 7319 5879 l
 7319 7069 l  cp gs col0 s gr 
%  polyline 
% Polyline
0.000 slw
n 6070 7069 m 6913 7069 l 6913 5879 l 6070 5879 l
 6070 7069 l  cp gs col34 1.00 shd ef gr 
% here ends figure;
% 
% here starts figure with depth 916
%  polyline 
% Polyline
7.500 slw
n 6070 7069 m 6913 7069 l 6913 5879 l 6070 5879 l
 6070 7069 l  cp gs col0 s gr 
%  polyline 
% Polyline
0.000 slw
n 4572 7069 m 5504 7069 l 5504 5879 l 4572 5879 l
 4572 7069 l  cp gs col35 1.00 shd ef gr 
% here ends figure;
% 
% here starts figure with depth 913
%  polyline 
% Polyline
7.500 slw
n 4572 7069 m 5504 7069 l 5504 5879 l 4572 5879 l
 4572 7069 l  cp gs col0 s gr 
%  polyline 
% Polyline
0.000 slw
n 2772 7069 m 3809 7069 l 3809 5879 l 2772 5879 l
 2772 7069 l  cp gs col36 1.00 shd ef gr 
% here ends figure;
% 
% here starts figure with depth 910
%  polyline 
% Polyline
7.500 slw
n 2772 7069 m 3809 7069 l 3809 5879 l 2772 5879 l
 2772 7069 l  cp gs col0 s gr 
%  polyline 
% Polyline
0.000 slw
n 609 7069 m 1776 7069 l 1776 5879 l 609 5879 l
 609 7069 l  cp gs col3 1.00 shd ef gr 
% here ends figure;
% 
% here starts figure with depth 907
%  polyline 
% Polyline
7.500 slw
n 609 7069 m 1776 7069 l 1776 5879 l 609 5879 l
 609 7069 l  cp gs col0 s gr 
% here ends figure;
% 
% here starts figure with depth 50
% Polyline
15.000 slw
gs  clippath
8490 6510 m 8490 6390 l 8203 6390 l 8443 6450 l 8203 6510 l cp
eoclip
n 7650 6450 m
 8475 6450 l gs col0 s gr gr

% arrowhead
n 8203 6510 m 8443 6450 l 8203 6390 l 8203 6510 l  cp gs 0.00 setgray ef gr  col0 s
% Polyline
gs  clippath
4515 6585 m 4515 6465 l 4228 6465 l 4468 6525 l 4228 6585 l cp
eoclip
n 3225 6525 m
 4500 6525 l gs col0 s gr gr

% arrowhead
n 4228 6585 m 4468 6525 l 4228 6465 l 4228 6585 l  cp gs 0.00 setgray ef gr  col0 s
/Helvetica-Bold-iso ff 300.00 scf sf
7725 6825 m
gs 1 -1 sc (p2) col0 sh gr
/Helvetica-Bold-iso ff 300.00 scf sf
3300 6900 m
gs 1 -1 sc (p1) col0 sh gr
/Symbol ff 300.00 scf sf
2850 6900 m
gs 1 -1 sc (r1) col0 sh gr
/Helvetica-Bold-iso ff 300.00 scf sf
3075 6300 m
gs 1 -1 sc (u1) col0 sh gr
/Symbol ff 300.00 scf sf
7350 6825 m
gs 1 -1 sc (r2) col0 sh gr
/Helvetica-Bold-iso ff 300.00 scf sf
7500 6300 m
gs 1 -1 sc (u2) col0 sh gr
/Helvetica-iso ff 375.00 scf sf
3825 8400 m
gs 1 -1 sc (volume de controle) col0 sh gr
/Bookman-Demi-iso ff 300.00 scf sf
1125 4575 m
gs 1 -1 sc (Particules fluides dans un \351coulement stationnaire) col0 sh gr
/Helvetica-Bold-iso ff 300.00 scf sf
3150 7575 m
gs 1 -1 sc (A) col0 sh gr
/Helvetica-Bold-iso ff 300.00 scf sf
5175 7575 m
gs 1 -1 sc (B) col0 sh gr
/Helvetica-Bold-iso ff 300.00 scf sf
7650 7500 m
gs 1 -1 sc (C) col0 sh gr
% here ends figure;
$F2psEnd
rs
showpage
