{
    "type": "mitabResult",
    "data": [{
        "idA": ["uniprotkb:P0CW72"],
        "idB": ["uniprotkb:P0CW72"],
        "interactionDetectionMethod": ["psi-mi:MI:0397(two hybrid array)"],
        "firstAuthor": ["Calderwood et al. (2007)"],
        "pubid": ["pubmed:17446270", "imex:IM-20435", "mint:MINT-6769080"],
        "taxidA": ["taxid:10376(ebvg)", "taxid:10376(\"Epstein-Barr virus (strain B95-8)\")"],
        "taxidB": ["taxid:10376(ebvg)", "taxid:10376(\"Epstein-Barr virus (strain B95-8)\")"],
        "interactionTypes": ["psi-mi:MI:0915(physical association)"],
        "sourceDatabases": ["psi-mi:MI:0469(IntAct)"],
        "interactionIdentifiers": ["intact:EBI-2620961", "imex:IM-20435-3"],
        "confidenceScore": ["author score:+", "intact-miscore:0.51"]
    }, {
        "idA": ["uniprotkb:P0C704"],
        "idB": ["uniprotkb:P14348"],
        "interactionDetectionMethod": ["psi-mi:MI:0397(two hybrid array)"],
        "firstAuthor": ["Calderwood et al. (2007)"],
        "pubid": ["pubmed:17446270", "imex:IM-20435", "mint:MINT-6769080"],
        "taxidA": ["taxid:10376(ebvg)", "taxid:10376(\"Epstein-Barr virus (strain B95-8)\")"],
        "taxidB": ["taxid:10377(ebvb9)", "taxid:10377(\"Epstein-Barr virus (strain B95-8) (HHV-4)\")"],
        "interactionTypes": ["psi-mi:MI:0915(physical association)"],
        "sourceDatabases": ["psi-mi:MI:0469(IntAct)"],
        "interactionIdentifiers": ["intact:EBI-2620972", "imex:IM-20435-4"],
        "confidenceScore": ["author score:+", "intact-miscore:0.37"]
    }, {
        "idA": ["uniprotkb:P0C722"],
        "idB": ["uniprotkb:Q96NT2"],
        "interactionDetectionMethod": ["psi-mi:MI:0018(two hybrid)"],
        "firstAuthor": ["Calderwood et al. (2007)"],
        "pubid": ["pubmed:17446270", "imex:IM-20435", "mint:MINT-6769080"],
        "taxidA": ["taxid:10376(ebvg)", "taxid:10376(\"Epstein-Barr virus (strain B95-8)\")"],
        "taxidB": ["taxid:9606(human)", "taxid:9606(Homo sapiens)"],
        "interactionTypes": ["psi-mi:MI:0915(physical association)"],
        "sourceDatabases": ["psi-mi:MI:0469(IntAct)"],
        "interactionIdentifiers": ["intact:EBI-2644156", "imex:IM-20435-230"],
        "confidenceScore": ["intact-miscore:0.37"]
    }]
}
