cybershake30arabnejad don't have the right number of result : 57 instead of 210
montage30arabnejad don't have the right number of result : 209 instead of 210
montage30ftl don't have the right number of result : 206 instead of 210
montage30ftlMultCascade don't have the right number of result : 198 instead of 210
montage30ftlMultLastTaskLvl don't have the right number of result : 198 instead of 210
montage30ftlMultCascadeNbChild don't have the right number of result : 198 instead of 210
montage30ftlMultCascadeChildDesc don't have the right number of result : 198 instead of 210
montage30ftlMultCascadeChildPath don't have the right number of result : 198 instead of 210
