cybershake30arabnejad don't have the right number of result : 0 instead of 210
ligo30arabnejad don't have the right number of result : 179 instead of 210
montage30ftlMultCascade don't have the right number of result : 196 instead of 210
montage30arabnejad don't have the right number of result : 180 instead of 210
montage30ftlMultCascadeNbChild don't have the right number of result : 196 instead of 210
montage30ftlMultCascadeChildDesc don't have the right number of result : 196 instead of 210
montage30ftlMultLastTaskLvl don't have the right number of result : 198 instead of 210
montage30ftlMultCascadeChildPath don't have the right number of result : 196 instead of 210
