
ids : 
----------------------------------------

generation : 0
number of free cores 10

individuals_ID0000001
bare_metal_5048

individuals_ID0000002
bare_metal_5048

individuals_ID0000003
bare_metal_5048

individuals_ID0000004
bare_metal_5048

individuals_ID0000005
bare_metal_5060

individuals_ID0000010
bare_metal_5060

individuals_ID0000006
bare_metal_5060

individuals_ID0000007
bare_metal_5024

individuals_ID0000008
bare_metal_5024

individuals_ID0000009
bare_metal_5036

----------------------------------------

generation : 2
number of free cores 7

sifting_ID0000012
bare_metal_5048

----------------------------------------

generation : 3
number of free cores 7

individuals_ID0000013
bare_metal_5048

----------------------------------------

generation : 4
number of free cores 7

individuals_ID0000014
bare_metal_5060

----------------------------------------

generation : 5
number of free cores 7

individuals_ID0000015
bare_metal_5060

----------------------------------------

generation : 6
number of free cores 7

individuals_ID0000016
bare_metal_5048

----------------------------------------

generation : 7
number of free cores 7

individuals_ID0000017
bare_metal_5060

----------------------------------------

generation : 8
number of free cores 7

individuals_ID0000018
bare_metal_5048

----------------------------------------

generation : 9
number of free cores 7

individuals_ID0000019
bare_metal_5024

----------------------------------------

generation : 10
number of free cores 7

individuals_ID0000020
bare_metal_5024

----------------------------------------

generation : 11
number of free cores 7

individuals_merge_ID0000011
bare_metal_5036

----------------------------------------

generation : 12
number of free cores 7

individuals_ID0000021
bare_metal_5036

----------------------------------------

generation : 13
number of free cores 7

individuals_ID0000022
bare_metal_5048

----------------------------------------

generation : 14
number of free cores 7

sifting_ID0000024
bare_metal_5048

----------------------------------------

generation : 15
number of free cores 7

mutation_overlap_ID0000025
bare_metal_5060

----------------------------------------

generation : 16
number of free cores 7

frequency_ID0000026
bare_metal_5060

----------------------------------------

generation : 17
number of free cores 7

mutation_overlap_ID0000027
bare_metal_5060

----------------------------------------

generation : 18
number of free cores 7

frequency_ID0000028
bare_metal_5048

----------------------------------------

generation : 19
number of free cores 7

mutation_overlap_ID0000029
bare_metal_5048

----------------------------------------

generation : 20
number of free cores 7

frequency_ID0000030
bare_metal_5060

----------------------------------------

generation : 21
number of free cores 7

mutation_overlap_ID0000031
bare_metal_5060

----------------------------------------

generation : 22
number of free cores 7

frequency_ID0000032
bare_metal_5060

----------------------------------------

generation : 23
number of free cores 7

mutation_overlap_ID0000033
bare_metal_5048

----------------------------------------

generation : 24
number of free cores 7

frequency_ID0000034
bare_metal_5048

----------------------------------------

generation : 25
number of free cores 7

mutation_overlap_ID0000035
bare_metal_5024

----------------------------------------

generation : 26
number of free cores 7

frequency_ID0000036
bare_metal_5024

----------------------------------------

generation : 27
number of free cores 7

mutation_overlap_ID0000037
bare_metal_5024

----------------------------------------

generation : 28
number of free cores 7

frequency_ID0000038
bare_metal_5048

----------------------------------------

generation : 29
number of free cores 15

individuals_merge_ID0000023
bare_metal_5048

----------------------------------------

generation : 30
number of free cores 16

mutation_overlap_ID0000039
bare_metal_5048

frequency_ID0000040
bare_metal_5048

mutation_overlap_ID0000041
bare_metal_5048

frequency_ID0000042
bare_metal_5048

mutation_overlap_ID0000043
bare_metal_5060

frequency_ID0000044
bare_metal_5060

mutation_overlap_ID0000045
bare_metal_5060

frequency_ID0000046
bare_metal_5024

mutation_overlap_ID0000047
bare_metal_5024

frequency_ID0000048
bare_metal_5036

----------------------------------------

generation : 31
number of free cores 7

mutation_overlap_ID0000049
bare_metal_5048

----------------------------------------

generation : 32
number of free cores 7

frequency_ID0000050
bare_metal_5048

----------------------------------------

generation : 33
number of free cores 7

mutation_overlap_ID0000051
bare_metal_5060

----------------------------------------

generation : 34
number of free cores 7

frequency_ID0000052
bare_metal_5048


