
ids : 
----------------------------------------

generation : 0
number of free cores 10

task01
bare_metal_5048

----------------------------------------

generation : 1
number of free cores 16

task02
bare_metal_5048

----------------------------------------

generation : 2
number of free cores 10

task03
bare_metal_5048

