{
    "alea": false,
    "algo": "MinMin",
    "budget": 100,
    "configPath": "/home/nanachibestwaifu/WORKDIR/wrench-2.1/examples/workflow_api/condor-grid-example/configDefaultLaunch.txt",
    "platformPath": "/home/nanachibestwaifu/WORKDIR/wrench-2.1/build/examples/workflow_api/condor-grid-example/condor-grid-PERSO-hosts222222.xml",
    "randomDeviation": 0.0,
    "randomMean": 5.0,
    "seed": 0,
    "workflowPath": "/home/nanachibestwaifu/WORKDIR/wrench-2.1/build/examples/workflow_api/condor-grid-example/1000genome-chameleon-2ch-100k-001.json"
}