module github.com/wowchemy/starter-academic/exampleSite

go 1.15

require (
	github.com/wowchemy/wowchemy-hugo-modules/wowchemy-cms/v5 v5.0.0-20211025220623-c43d078def74 // indirect
	github.com/wowchemy/wowchemy-hugo-modules/wowchemy/v5 v5.0.0-20211025220623-c43d078def74 // indirect
)
