{
  "realm": "datasecurity",
  "users": [],
  "clients": [
    {
      "clientId": "datasecurity",
      "protocol": "openid-connect",
      "rootUrl": "ds-connect",
      "redirectUris": [
        "ds-connect/*",
        "http://localhost:8080/*"
      ]
    }
  ],
  "roles": {
    "realm": [
      
    ]
  }
}
