module forge.univ-lyon1.fr/EMMANUEL.COQUERY/emmanuel.coquery.pages.univ-lyon1.fr

go 1.15

require (
	github.com/HugoBlox/hugo-blox-builder/modules/blox-bootstrap/v5 v5.9.7
	github.com/HugoBlox/hugo-blox-builder/modules/blox-core v0.3.1 // indirect
	github.com/HugoBlox/hugo-blox-builder/modules/blox-plugin-netlify v1.1.2-0.20240506221655-75a42222e9a5
	github.com/HugoBlox/hugo-blox-builder/modules/blox-plugin-reveal v1.1.2
	github.com/HugoBlox/hugo-blox-builder/modules/blox-seo v0.2.2 // indirect
)
